Trichloroacetic acid, decyl ester
- Formula: C12H21Cl3O2
- Molecular weight: 303.653
- IUPAC Standard InChIKey: JVOWHDCGJSEUMO-UHFFFAOYSA-N
- CAS Registry Number: 65611-33-8
- Chemical structure:
View 3d structure (requires JavaScript / HTML 5) - Other names: Decyl trichloroacetate

Kovats' RI, non-polar column, isothermal

Column type | Active phase | Temperature (C) | I | Reference | Comment |
---|---|---|---|---|---|
Capillary | OV-101 | 200. | 1762.7 | Komárek, Hornová, et al., 1982 | N2; Column length: 15. m; Column diameter: 0.22 mm |
Packed | SE-30 | 200. | 1771. | Golovkin, Smol'chenko, et al., 1980 | N2, Chromaton N-AW-DMCS; Column length: 1. m |

Van Den Dool and Kratz RI, non-polar column, custom temperature program

Column type | Active phase | I | Reference | Comment |
---|---|---|---|---|
Capillary | DB-1 | 1760. | Peng, 2000 | 15. m/0.53 mm/1. μm, He; Program: 40C(3min) => 8C/min => 200(1min) => 5C/min => 300C(25min) |

Van Den Dool and Kratz RI, polar column, temperature ramp

Column type | Active phase | I | Reference | Comment |
---|---|---|---|---|
Capillary | DB-Wax | 2160. | Peng, 2000 | 15. m/0.53 mm/1. μm, He, 40. C @ 3. min, 5. K/min, 220. C @ 30. min |

References

Komárek, Hornová, et al., 1982
Komárek, K.; Hornová, L.; Churácek, J.,
Glass capillary gas chromatography of homologous series of esters. Separation of homologous series of esters of halogenated carboxylic acids on a glass capillary column with the non-polar stationary silicone phase OV-101,
J. Chromatogr., 1982, 244, 1, 142-147, https://doi.org/10.1016/S0021-9673(00)80131-4
. [all data]
Golovkin, Smol'chenko, et al., 1980
Golovkin, G.V.; Smol'chenko, A.I.; Zotov, L.N.; Sazonov, S.E.,
Systems of gas-chromatographic retention indices for identifying pesticides by means of selective detectors,
Zh. Anal. Khim., 1980, 35, 5, 651-655. [all data]
Peng, 2000
Peng, C.T.,
Prediction of retention indices. V. Influence of electronic effects and column polarity on retention index,
J. Chromatogr. A, 2000, 903, 1-2, 117-143, https://doi.org/10.1016/S0021-9673(00)00901-8
. [all data]