Etiocholanolone, TBDMS derivative
- Formula: C25H44O2Si
- Molecular weight: 404.7012
- IUPAC Standard InChIKey: UGWVQACEZWDYMD-KZENVJRNSA-N
- CAS Registry Number: 65598-73-4
- Chemical structure:
- Other names: Androstan-17-one, 3-[[(1,1-dimethylethyl)dimethylsilyl]oxy]-, (3α,5β)-; Etiocholan-3α-ol-17-one, tert-butyldimethylsilyl ether; 3-α-tert-butyldimethylsilyloxy-5-β-androstan-17-one; Ethiocholan-3α-ol-17-one, tert-butyldimethylsilyl ether

Van Den Dool and Kratz RI, non-polar column, custom temperature program

Column type | Active phase | I | Reference | Comment |
---|---|---|---|---|
Capillary | VF-5MS | 2810.4 | Tret'yakov, 2007 | 30. m/0.25 mm/0.25 μm, He; Program: Multi-step temperature program; T(initial)=60C; T(final)=270C |
Capillary | VF-5MS | 2814.3 | Tret'yakov, 2007 | 30. m/0.25 mm/0.25 μm, He; Program: Multi-step temperature program; T(initial)=60C; T(final)=270C |

References

Tret'yakov, 2007
Tret'yakov, K.V.,
Retention Data. NIST Mass Spectrometry Data Center., NIST Mass Spectrometry Data Center, 2007. [all data]