N-t-Butylmethacrylamide
- Formula: C8H15NO
- Molecular weight: 141.2108
- IUPAC Standard InChIKey: QQZXAODFGRZKJT-UHFFFAOYSA-N
- CAS Registry Number: 6554-73-0
- Chemical structure:

Phase change data

Data compiled as indicated in comments:
BS - Robert L. Brown and Stephen E. Stein
AC - William E. Acree, Jr., James S. Chickos
Reduced pressure boiling point
Tboil (K) | Pressure (atm) | Reference | Comment |
---|---|---|---|
366. to 368. | 0.026 | Frinton Laboratories Inc., 1986 | BS |
Enthalpy of vaporization
ΔvapH (kcal/mol) | Temperature (K) | Method | Reference | Comment |
---|---|---|---|---|
11.9 | 355. | A | Stephenson and Malanowski, 1987 | Based on data from 340. to 467. K.; AC |

References

Frinton Laboratories Inc., 1986
Frinton Laboratories Inc.,
Catalog Number 11, Frinton Laboratories Inc., Vineland, NJ, 1986, 99. [all data]
Stephenson and Malanowski, 1987
Stephenson, Richard M.; Malanowski, Stanislaw,
Handbook of the Thermodynamics of Organic Compounds, 1987, https://doi.org/10.1007/978-94-009-3173-2
. [all data]