Oxirane-d4

Phase change data

Data compiled by: William E. Acree, Jr., James S. Chickos

Enthalpy of vaporization

ΔvapH (kJ/mol) Temperature (K) Reference Comment
27.6258.Leitch and Morse, 1952Based on data from 230. - 273. K. See also Boublik, Fried, et al., 1984.

References

Leitch and Morse, 1952
Leitch, L.C.; Morse, A.T., SYNTHESIS OF ORGANIC DEUTERIUM COMPOUNDS: III. 1,2-DIBROMOETHANE- d 4 AND ITS DERIVATIVES, Can. J. Chem., 1952, 30, 12, 924-932, https://doi.org/10.1139/v52-112 . [all data]

Boublik, Fried, et al., 1984
Boublik, T.; Fried, V.; Hala, E., The Vapour Pressures of Pure Substances: Selected Values of the Temperature Dependence of the Vapour Pressures of Some Pure Substances in the Normal and Low Pressure Region, 2nd ed., Elsevier, New York, 1984, 972. [all data]