2-Butoxyethyl bromide
- Formula: C6H13BrO
- Molecular weight: 181.071
- IUPAC Standard InChIKey: WOLUYEFMPZAHNN-UHFFFAOYSA-N
- CAS Registry Number: 6550-99-8
- Chemical structure:

Phase change data

Data compiled by: Robert L. Brown and Stephen E. Stein
Reduced pressure boiling point
Tboil (K) | Pressure (atm) | Reference |
---|---|---|
332. to 333. | 0.017 | Frinton Laboratories Inc., 1986 |

References

Frinton Laboratories Inc., 1986
Frinton Laboratories Inc.,
Catalog Number 11, Frinton Laboratories Inc., Vineland, NJ, 1986, 99. [all data]