4-Decenal, (E)-

Normal alkane RI, polar column, temperature ramp

Data compiled by: NIST Mass Spectrometry Data Center, William E. Wallace, director

Column type Capillary
Active phase TC-WAX
Column length (m) 60.
Carrier gas Helium
Substrate
Column diameter (mm) 0.25
Phase thickness (μm)
Tstart (C) 40.
Tend (C) 230.
Heat rate (K/min) 3.
Initial hold (min) 3.
Final hold (min)
I 1545.
ReferenceMiyazawa, Tomita, et al., 2009
Comment MSDC-RI

Normal alkane RI, non-polar column, custom temperature program

Data compiled by: NIST Mass Spectrometry Data Center, William E. Wallace, director

Column type Capillary
Active phase DB-5
Column length (m) 50.
Carrier gas Helium
Substrate
Column diameter (mm) 0.32
Phase thickness (μm) 0.25
Program 60 0C (1 min) 5 0C/min -> 160 0C 10 0C/min -> 250 0C
I 1197.
ReferenceNivinsliene, Butkiene, et al., 2007
Comment MSDC-RI

Van Den Dool and Kratz RI, non-polar column, temperature ramp

View large format table.

Column type Active phase I Reference Comment
CapillaryRTX-51199.Mondello, Zappia, et al., 200230. m/0.25 mm/0.25 μm, He, 45. C @ 6. min, 3. K/min, 300. C @ 10. min

Normal alkane RI, non-polar column, temperature ramp

View large format table.

Column type Active phase I Reference Comment
CapillaryDB-51200.Morteza-Semnani, Saeedi, et al., 200630. m/0.25 mm/0.25 μm, He, 60. C @ 4. min, 4. K/min; Tend: 260. C

Phase change data

Data compiled by: William E. Acree, Jr., James S. Chickos

Quantity Value Units Method Reference Comment
Δvap14.kcal/molCGCKoutek, Hoskovec, et al., 1996Based on data from 323. - 343. K. See also Ova, Koultek, et al., 2000.

References

Miyazawa, Tomita, et al., 2009
Miyazawa, N.; Tomita, N.; Kurobayashi, Y.; Nakanishi, A.; Ohkubo, Y.; Maeda, T.; Fujita, A., Novel character impact compounds in Yuzu (Citrus junos Sieb. ex Tanaka) Peel oil, J. Agric. Food Chem., 2009, 57, 5, 1990-1996, https://doi.org/10.1021/jf803257x . [all data]