dichlorobis(1-octanamine)zinc

Phase change data

Data compiled by: Thermodynamics Research Center, NIST Boulder Laboratories, Chris Muzny director

Quantity Value Units Method Reference Comment
Tfus422.KN/ASalerno, Landi, et al., 1977Crystal phase 1 phase; Uncertainty assigned by TRC = 1. K

In addition to the Thermodynamics Research Center (TRC) data available from this site, much more physical and chemical property data is available from the following TRC products:

References

Salerno, Landi, et al., 1977
Salerno, V.; Landi, E.; Vacatello, M., Transition metal complexes with long-chain amines thermal behaviour and crystal structure of (n-CnH2n+1NH2)2ZnCl2, Thermochim. Acta, 1977, 20, 407. [all data]