pinacol monoformate
- Formula: C7H14O3
- Molecular weight: 146.1843
- IUPAC Standard InChIKey: OBODCWUESPNUOV-UHFFFAOYSA-N
- CAS Registry Number: 65184-58-9
- Chemical structure:
View 3d structure (requires JavaScript / HTML 5) - Other names: 2,3-Butanediol, 2,3-dimethyl-, monoformate

Gas phase thermochemistry data

Data compiled by: Hussein Y. Afeefy, Joel F. Liebman, and Stephen E. Stein
Quantity | Value | Units | Method | Reference | Comment |
---|---|---|---|---|---|
ΔfH°gas | -676.3 ± 9.8 | kJ/mol | Cm | Guthrie, 1977 | Hydrolysis |

Condensed phase thermochemistry data

Data compiled by: Hussein Y. Afeefy, Joel F. Liebman, and Stephen E. Stein
Quantity | Value | Units | Method | Reference | Comment |
---|---|---|---|---|---|
ΔfH°liquid | -732.3 ± 8.9 | kJ/mol | Cm | Guthrie, 1977 | Hydrolysis |

Phase change data

Data compiled as indicated in comments:
ALS - Hussein Y. Afeefy, Joel F. Liebman, and Stephen E. Stein
DRB - Donald R. Burgess, Jr.
Quantity | Value | Units | Method | Reference | Comment |
---|---|---|---|---|---|
ΔvapH° | 55.9 ± 4.2 | kJ/mol | E | Guthrie, 1977 | Hydrolysis; ALS |
ΔvapH° | 56.0 | kJ/mol | N/A | Guthrie, 1977 | DRB |

References

Guthrie, 1977
Guthrie, J.P.,
Cyclization of glycol monoesters to give hemiorthoesters: a test of the thermochemical method for determining free energies of tetrahedral intermediates,
Can. J. Chem., 1977, 55, 3562-3574. [all data]