pyridine, 3,6-dimethyl-2-nitro-

Phase change data

Data compiled by: Thermodynamics Research Center, NIST Boulder Laboratories, Chris Muzny director

Quantity Value Units Method Reference Comment
Tfus421.65KN/AProstakov, Gaivoronskaya, et al., 1963Uncertainty assigned by TRC = 2. K

In addition to the Thermodynamics Research Center (TRC) data available from this site, much more physical and chemical property data is available from the following TRC products:

References

Prostakov, Gaivoronskaya, et al., 1963
Prostakov, N.S.; Gaivoronskaya, L.A.; Mikheeva, N.N.; Filippov, N.P., Substituted Pyridines: 2,5-Dimethyl-4-alkylpyridines, Zh. Obshch. Khim., 1963, 33, 2928. [all data]