2-Hydroxy-3,5,6-trichloropyridine
- Formula: C5H2Cl3NO
- Molecular weight: 198.434
- IUPAC Standard InChIKey: WCYYAQFQZQEUEN-UHFFFAOYSA-N
- CAS Registry Number: 6515-38-4
- Chemical structure:
View 3d structure (requires JavaScript / HTML 5) - Other names: 2(1H)-Pyridinone, 3,5,6-trichloro-; 2(1H)-Pyridone, 3,5,6-trichloro-; 3,5,6-Trichloro-2-pyridinol; 3,5,6-Trichloro-2-hydroxypyridine; 2-Pyridinol, 3,5,6-trichloro-; 3,5,6-Trichloropyridin-2-ol; 3,5,6 Trichloro 2-pyridinal; 3,5,6-trichloro-2-pyridone

Phase change data

Data compiled as indicated in comments:
TRC - Thermodynamics Research Center, NIST Boulder Laboratories, Chris Muzny director
AC - William E. Acree, Jr., James S. Chickos
Quantity | Value | Units | Method | Reference | Comment |
---|---|---|---|---|---|
Tfus | 447.94 | K | N/A | Donnelly, Drewes, et al., 1990 | Uncertainty assigned by TRC = 0.2 K; TRC |
Enthalpy of vaporization
ΔvapH (kcal/mol) | Temperature (K) | Method | Reference | Comment |
---|---|---|---|---|
15.1 | 373. to 403. | GC | Goel, McConnell, et al., 2007 | AC |
Enthalpy of fusion
ΔfusH (kcal/mol) | Temperature (K) | Reference | Comment |
---|---|---|---|
6.164 | 448.1 | Acree, 1991 | AC |

References

Donnelly, Drewes, et al., 1990
Donnelly, J.R.; Drewes, L.A.; Johnson, R.L.; Munslow, W.D.; Knapp, K.K.; Sovocool, G.W.,
Purity and heat of fusion data for environmental standards as determined by differential scanning calorimetry,
Thermochim. Acta, 1990, 167, 2, 155, https://doi.org/10.1016/0040-6031(90)80476-F
. [all data]
Goel, McConnell, et al., 2007
Goel, Anubha; McConnell, Laura L.; Torrents, Alba,
Determination of vapor pressure-temperature relationships of current--use pesticides and transformation products,
Journal of Environmental Science and Health, Part B, 2007, 42, 4, 343-349, https://doi.org/10.1080/03601230701309494
. [all data]
Acree, 1991
Acree, William E.,
Thermodynamic properties of organic compounds: enthalpy of fusion and melting point temperature compilation,
Thermochimica Acta, 1991, 189, 1, 37-56, https://doi.org/10.1016/0040-6031(91)87098-H
. [all data]