2,2,3,3,4,4,5,5-Octamethylhexane

Condensed phase thermochemistry data

Data compiled by: Hussein Y. Afeefy, Joel F. Liebman, and Stephen E. Stein

Quantity Value Units Method Reference Comment
Δfliquid-305.2 ± 2.3kJ/molCcbVerevkin, Nolke, et al., 1997
Quantity Value Units Method Reference Comment
Δcliquid-9491.4 ± 2.3kJ/molCcbVerevkin, Nolke, et al., 1997Corresponding Δfliquid = -305.2 kJ/mol (simple calculation by NIST; no Washburn corrections)

Phase change data

Data compiled as indicated in comments:
TRC - Thermodynamics Research Center, NIST Boulder Laboratories, Chris Muzny director
ALS - Hussein Y. Afeefy, Joel F. Liebman, and Stephen E. Stein
AC - William E. Acree, Jr., James S. Chickos

Quantity Value Units Method Reference Comment
Tfus327.KN/ABondar and Zelinskii, 1950Uncertainty assigned by TRC = 5. K; TRC
Quantity Value Units Method Reference Comment
Δvap13.6 ± 0.2kcal/molVVerevkin, Nolke, et al., 1997ALS
Δvap13.6 ± 0.2kcal/molGSVerevkin, Nolke, et al., 1997Based on data from 288. - 325. K.; AC

In addition to the Thermodynamics Research Center (TRC) data available from this site, much more physical and chemical property data is available from the following TRC products:

References

Verevkin, Nolke, et al., 1997
Verevkin, S.P.; Nolke, M.; Beckhaus, H.D.; Ruchardt, C., Enthalpies of formation of hexaethylethane, octamethylhexane, and tri-tert-butylmethane. Extremely strained hydrocarbons, J. Org. Chem., 1997, 62, 4683-4686. [all data]