2,2,3,3,4,4,5,5-Octafluoropentyl-1',1',2',3',3',3'-hexafluoropropyl ether

Phase change data

Data compiled by: Hussein Y. Afeefy, Joel F. Liebman, and Stephen E. Stein

Quantity Value Units Method Reference Comment
Δvap47.0kJ/molCErastov and Kolesov, 1979

References

Erastov and Kolesov, 1979
Erastov, P.A.; Kolesov, V.P., Standard enthalpies of formation of some fluorine-containing ethers, Termodin. Org. Soedin., 1979, 55-59. [all data]