2,2,3,3-Tetrafluoropropyl-1',1',2',3',3'-hexafluoropropyl ether

Gas phase thermochemistry data

Data compiled by: Hussein Y. Afeefy, Joel F. Liebman, and Stephen E. Stein

Quantity Value Units Method Reference Comment
Δfgas  CmAndreevskii and Antonova, 1982uncertain value: -2330. kJ/mol
Δfgas-2330.5kJ/molCcbErastov and Kolesov, 1979

Condensed phase thermochemistry data

Data compiled by: Hussein Y. Afeefy, Joel F. Liebman, and Stephen E. Stein

Quantity Value Units Method Reference Comment
Δfliquid-2370.2 ± 4.6kJ/molCcbErastov and Kolesov, 1979
Quantity Value Units Method Reference Comment
Δcliquid-2320.4 ± 4.6kJ/molCcbErastov and Kolesov, 1979

Phase change data

Data compiled as indicated in comments:
ALS - Hussein Y. Afeefy, Joel F. Liebman, and Stephen E. Stein
AC - William E. Acree, Jr., James S. Chickos

Quantity Value Units Method Reference Comment
Δvap39.7kJ/molCErastov and Kolesov, 1979ALS

Enthalpy of vaporization

ΔvapH (kJ/mol) Temperature (K) Method Reference Comment
42.3308.IMurata, Yamashita, et al., 2002Based on data from 293. - 379. K.; AC

References

Andreevskii and Antonova, 1982
Andreevskii, D.N.; Antonova, Z.A., Development of an increment scheme for calculating the thermodynamic properties of organic polyfluoro compounds, J. Appl. Chem. USSR, 1982, 55, 582-587. [all data]

Erastov and Kolesov, 1979
Erastov, P.A.; Kolesov, V.P., Standard enthalpies of formation of some fluorine-containing ethers, Termodin. Org. Soedin., 1979, 55-59. [all data]

Murata, Yamashita, et al., 2002
Murata, Junji; Yamashita, Shiro; Akiyama, Minoru; Katayama, Shinichiro; Hiaki, Toshihiko; Sekiya, Akira, Vapor Pressures of Hydrofluoroethers, J. Chem. Eng. Data, 2002, 47, 4, 911-915, https://doi.org/10.1021/je010322y . [all data]