H2CCO+

Ion clustering data

Data compiled by: Michael M. Meot-Ner (Mautner) and Sharon G. Lias

Clustering reactions

C2H2O+ + Water = (C2H2O+ • Water)

By formula: C2H2O+ + H2O = (C2H2O+ • H2O)

Quantity Value Units Method Reference Comment
Δr48.5kJ/molEIPostma, Ruttink, et al., 1986gas phase; based on AE(CH2CO+)H2O from (HOCH2)2CO+

References

Postma, Ruttink, et al., 1986
Postma, R.; Ruttink, P.; Terlouw, J.; Holmes, J., The ketene-water radical cation dipole complex [CH2CO.H2O]+, J. Chem. Soc., Chem. Commun., 1986, 683. [all data]