CAS Reg. No. 64924-57-8
- CAS Registry Number: 64924-57-8

Reaction thermochemistry data

Data compiled by: John E. Bartmess
Individual Reactions
(CAS Reg. No. 64924-57-8 • 4294967295) +
= CAS Reg. No. 64924-57-8
By formula: (CAS Reg. No. 64924-57-8 • 4294967295Sc) + Sc = CAS Reg. No. 64924-57-8
Quantity | Value | Units | Method | Reference | Comment |
---|---|---|---|---|---|
ΔrH° | 673.6 ± 4.6 | kJ/mol | N/A | Wu and Wang, 1998 | gas phase |

References

Wu and Wang, 1998
Wu, H.B.; Wang, L.S.,
Photoelectron spectroscopy and electronic structure of ScOn- (n = 1-4) and YOn- (n = 1-5): Strong electron correlation effects in ScO- and YO-,
J. Phys. Chem. A, 1998, 102, 46, 9129-9135, https://doi.org/10.1021/jp982588q
. [all data]