CAS Reg. No. 64899-88-3
- CAS Registry Number: 64899-88-3

Reaction thermochemistry data

Data compiled by: John E. Bartmess
Individual Reactions
(CAS Reg. No. 64899-88-3 • 4294967295) +
= CAS Reg. No. 64899-88-3
By formula: (CAS Reg. No. 64899-88-3 • 4294967295Fe) + Fe = CAS Reg. No. 64899-88-3
Quantity | Value | Units | Method | Reference | Comment |
---|---|---|---|---|---|
ΔrH° | 43.1 ± 7.0 | kcal/mol | N/A | Stevens, Feigerle, et al., 1983 | gas phase |

References

Stevens, Feigerle, et al., 1983
Stevens, A.E.; Feigerle, C.S.; Lineberger, W.C.,
Laser photoelectron spectroscopy of MnH- and FeH-: Electronic structures of the metal hydrides, identification of a low spin excited state of MnH,
J. Chem. Phys., 1983, 78, 5420. [all data]