Silane, [[(17β)-androsta-3,5-diene-3,17-diyl]bis(oxy)]bis[(1,1-dimethylethyl)dimethyl-

Kovats' RI, non-polar column, isothermal

View large format table.

Column type Active phase Temperature (C) I Reference Comment
PackedOV-1230.3241.Quilliam and Westmore, 1978Gas Chrom Q; Column length: 1. m
PackedOV-1260.3300.Quilliam and Westmore, 1978Gas Chrom Q; Column length: 1. m

References

Quilliam and Westmore, 1978
Quilliam, M.A.; Westmore, J.B., Sterically crowded trialkylsilyl derivatives for chromatography and mass spectrometry of biologically-important compounds, Anal. Chem., 1978, 50, 1, 59-68, https://doi.org/10.1021/ac50023a020 . [all data]