C7 anion
- Formula: C7-
- Molecular weight: 84.0754
- CAS Registry Number: 64886-38-0

Gas phase thermochemistry data

Data compiled by: John E. Bartmess
Quantity | Value | Units | Method | Reference | Comment |
---|---|---|---|---|---|
ΔfH°gas | 1015. ± 19. | kJ/mol | R-EA | Arnold, Bradforth, et al., 1991 | Linear structure for both neutral and anion |

Ion clustering data

Data compiled by: John E. Bartmess
Clustering reactions
By formula: (C7- • 4294967295C) + C = C7-
Quantity | Value | Units | Method | Reference | Comment |
---|---|---|---|---|---|
ΔrH° | 478. ± 31. | kJ/mol | N/A | Arnold, Bradforth, et al., 1991 | gas phase; Linear structure for both neutral and anion |

Reaction thermochemistry data

Data compiled by: John E. Bartmess
Individual Reactions
By formula: (C7- • 4294967295C) + C = C7-
Quantity | Value | Units | Method | Reference | Comment |
---|---|---|---|---|---|
ΔrH° | 114.2 ± 7.3 | kcal/mol | N/A | Arnold, Bradforth, et al., 1991 | gas phase; Linear structure for both neutral and anion |

Vibrational and/or electronic energy levels

Data compiled by: Marilyn E. Jacox

State:   ?

 Energy
 (cm-1
 Med.   Transition   λmin
 (nm)
 λmax
 (nm)

References

Arnold, Bradforth, et al., 1991
Arnold, D.W.; Bradforth, S.E.; Kitsopoulos, T.N.; Neumark, D.M.,
Vibrationally Resolved Spectra of C2-C11 by Anion Photoelectron Spectroscopy,
J. Chem. Phys., 1991, 95, 12, 8753, https://doi.org/10.1063/1.461211
. [all data]