C6 anion
- Formula: C6-
- Molecular weight: 72.0647
- CAS Registry Number: 64886-37-9

Gas phase thermochemistry data

Data compiled by: John E. Bartmess
Quantity | Value | Units | Method | Reference | Comment |
---|---|---|---|---|---|
ΔfH°gas | 776. ± 24. | kJ/mol | Acid | Arnold, Zhao, et al., 1992 | There is a bound state at 47.107 kcal/mol up; Zhao, de Beer, et al., 1996 |

Ion clustering data

Data compiled by: John E. Bartmess
Clustering reactions
By formula: (C6- • 4294967295C) + C = C6-
Quantity | Value | Units | Method | Reference | Comment |
---|---|---|---|---|---|
ΔrH° | -59. ± 24. | kJ/mol | N/A | Arnold, Zhao, et al., 1992 | gas phase; There is a bound state at 47.107 kcal/mol up; Zhao, de Beer, et al., 1996 |

References

Arnold, Zhao, et al., 1992
Arnold, C.C.; Zhao, Y.X.; Kitsopoulos, T.N.; Neumark, D.M.,
Study of C6(-) and C6 with Threshold Photodetachment Spectroscopy and Autodetachment Spectroscopy,
J. Chem. Phys., 1992, 97, 9, 6121, https://doi.org/10.1063/1.463722
. [all data]
Zhao, de Beer, et al., 1996
Zhao, Y.; de Beer, E.; Xu, C.; Taylor, T.; Neumark, D.M.,
Spectroscopy and Electron Detachment Dynamics of C4-, C6- and C8-,
J. Chem. Phys., 1996, 105, 12, 4905, https://doi.org/10.1063/1.472341
. [all data]