Deoxycorticosterone
- Formula: C21H30O3
- Molecular weight: 330.4611
- IUPAC Standard InChIKey: ZESRJSPZRDMNHY-VQBCACJISA-N
- CAS Registry Number: 64-85-7
- Chemical structure:

Condensed phase thermochemistry data

Data compiled by: Hussein Y. Afeefy, Joel F. Liebman, and Stephen E. Stein
Quantity | Value | Units | Method | Reference | Comment |
---|---|---|---|---|---|
ΔcH°solid | -2876. ± 1. | kcal/mol | Ccb | Paoli, Garrigues, et al., 1969 | Corresponding ΔfHºsolid = -124. kcal/mol (simple calculation by NIST; no Washburn corrections) |

Phase change data

Data compiled by: William E. Acree, Jr., James S. Chickos
Enthalpy of fusion
ΔfusH (kcal/mol) | Temperature (K) | Reference |
---|---|---|
6.687 | 414. | Regosz, Chmielewska, et al., 1994 |

Van Den Dool and Kratz RI, non-polar column, custom temperature program

Column type | Active phase | I | Reference | Comment |
---|---|---|---|---|
Capillary | VF-5MS | 3106.6 | Tret'yakov, 2007 | 30. m/0.25 mm/0.25 μm, He; Program: Multi-step temperature program; T(initial)=60C; T(final)=270C |

References

Paoli, Garrigues, et al., 1969
Paoli, D.; Garrigues, J.-C.; Patin, H.,
Combustion microcalorimetry: application to steroids,
C. R. Acad. Sci. Paris, 1969, 268, 780-783. [all data]
Regosz, Chmielewska, et al., 1994
Regosz, A.; Chmielewska, A.; Pelplinska, T.; Kowalski, P.,
Prediction of the solubility of steroid hormones,
Pharmazie, 1994, 49, 5, 371. [all data]
Tret'yakov, 2007
Tret'yakov, K.V.,
Retention Data. NIST Mass Spectrometry Data Center., NIST Mass Spectrometry Data Center, 2007. [all data]