Ammonium nitrate
- Formula: H4N2O3
- Molecular weight: 80.0434
- IUPAC Standard InChIKey: ASFXIDPWCNUKTK-UHFFFAOYSA-N
- CAS Registry Number: 6484-52-2
- Chemical structure:

Phase change data

Data compiled by: William E. Acree, Jr., James S. Chickos
Quantity | Value | Units | Method | Reference | Comment |
---|---|---|---|---|---|
ΔsubH° | 174.9 | kJ/mol | N/A | Luft, 1955 |
Enthalpy of sublimation
ΔsubH (kJ/mol) | Temperature (K) | Reference |
---|---|---|
178.7 | 349. to 438. | Brandner, Junk, et al., 1962 |

References

Luft, 1955
Luft, N.W.,
Ind. Chemist, 1955, 31, 502. [all data]
Brandner, Junk, et al., 1962
Brandner, J.D.; Junk, N.M.; Lawrence, J.W.; Robins, Jack,
Vapor Pressure of Ammonium Nitrate.,
J. Chem. Eng. Data, 1962, 7, 2, 227-228, https://doi.org/10.1021/je60013a020
. [all data]