4-Penten-2-ol, 1,1,1-trifluoro-2-(trifluoromethyl)-
- Formula: C6H6F6O
- Molecular weight: 208.1017
- IUPAC Standard InChIKey: VHSCQANAKTXZTG-UHFFFAOYSA-N
- CAS Registry Number: 646-97-9
- Chemical structure:
View 3d structure (requires JavaScript / HTML 5) - Other names: 1,1,1-Trifluoro-2-(trifluoromethyl)pent-4-en-2-ol

Reaction thermochemistry data

Data compiled by: Hussein Y. Afeefy, Joel F. Liebman, and Stephen E. Stein
Individual Reactions
By formula: C3H6 + C3F6O = C6H6F6O
Quantity | Value | Units | Method | Reference | Comment |
---|---|---|---|---|---|
ΔrH° | -78.2 ± 4.2 | kJ/mol | Eqk | Moore, 1971 | gas phase |

References

Moore, 1971
Moore, L.O.,
Kinetics and thermodynamic data for the hydrogen fluoride addition to vinyl fluoride,
Can. J. Chem., 1971, 49, 2471-2475. [all data]