1,10-Diaminodecane
- Formula: C10H24N2
- Molecular weight: 172.3110
- IUPAC Standard InChIKey: YQLZOAVZWJBZSY-UHFFFAOYSA-N
- CAS Registry Number: 646-25-3
- Chemical structure:
View 3d structure (requires JavaScript / HTML 5) - Other names: 1,10-Decanediamine; Decamethylenediamine; Decyldiamine; 1,10-Decamethylenediamine; 1,10-Decylenediamine

Phase change data

Data compiled as indicated in comments:
BS - Robert L. Brown and Stephen E. Stein
AC - William E. Acree, Jr., James S. Chickos
Reduced pressure boiling point
Tboil (K) | Pressure (bar) | Reference | Comment |
---|---|---|---|
413.2 | 0.016 | Weast and Grasselli, 1989 | BS |
Enthalpy of fusion
ΔfusH (kJ/mol) | Temperature (K) | Reference | Comment |
---|---|---|---|
57.81 | 332.9 | Dall'Acqua, Della Gatta, et al., 2002 | AC |

Gas phase ion energetics data

Data compiled by: Michael M. Meot-Ner (Mautner)
Gas basicity at 298K
Gas basicity (review) (kJ/mol) | Reference | Comment |
---|---|---|
946. ± 21. | Gross, Rodriguez-Cruz, et al., 1995 | T = 300K; Di-n-propylamine; Tri-n-butylamine. Reference GBs readjusted to Hunter and Lias, 1998. Cited uncertainty is half of the ΔGB between the bracketing bases |

Van Den Dool and Kratz RI, non-polar column, custom temperature program

Column type | Active phase | I | Reference | Comment |
---|---|---|---|---|
Capillary | DB-1 | 1476. | Peng, 2000 | 15. m/0.53 mm/1. μm, He; Program: 40C(3min) => 8C/min => 200(1min) => 5C/min => 300C(25min) |

Van Den Dool and Kratz RI, polar column, temperature ramp

Column type | Active phase | I | Reference | Comment |
---|---|---|---|---|
Capillary | HP-Wax | 2061. | Peng, 2000 | 15. m/0.53 mm/1. μm, He, 40. C @ 3. min, 5. K/min, 220. C @ 30. min |

References

Weast and Grasselli, 1989
CRC Handbook of Data on Organic Compounds, 2nd Editon, Weast,R.C and Grasselli, J.G., ed(s)., CRC Press, Inc., Boca Raton, FL, 1989, 1. [all data]
Dall'Acqua, Della Gatta, et al., 2002
Dall'Acqua, Lorenzo; Della Gatta, Giuseppe; Nowicka, Bozenna; Ferloni, Paolo,
Enthalpies and entropies of fusion of ten alkane-α, ω-diamines H2 N-- (CH 2)n-- NH2 where 3≤n≤12,
The Journal of Chemical Thermodynamics, 2002, 34, 1, 1-12, https://doi.org/10.1006/jcht.2001.0950
. [all data]
Gross, Rodriguez-Cruz, et al., 1995
Gross, D.S.; Rodriguez-Cruz, S.E.; Bock, S.; Williams, E.R.,
Measurement of the Coulomb Energy and Dielectric Polarizability of Gas-Phase Diprotonated Diaminoalkanes,
J. Phys. Chem., 1995, 99, 4034. [all data]
Hunter and Lias, 1998
Hunter, E.P.; Lias, S.G.,
Evaluated Gas Phase Basicities and Proton Affinities of Molecules: An Update,
J. Phys. Chem. Ref. Data, 1998, 27, 3, 413-656, https://doi.org/10.1063/1.556018
. [all data]
Peng, 2000
Peng, C.T.,
Prediction of retention indices. V. Influence of electronic effects and column polarity on retention index,
J. Chromatogr. A, 2000, 903, 1-2, 117-143, https://doi.org/10.1016/S0021-9673(00)00901-8
. [all data]