Heptanedinitrile

Phase change data

Data compiled as indicated in comments:
BS - Robert L. Brown and Stephen E. Stein
AC - William E. Acree, Jr., James S. Chickos

Reduced pressure boiling point

Tboil (K) Pressure (bar) Reference Comment
448.70.019Aldrich Chemical Company Inc., 1990BS

Enthalpy of vaporization

ΔvapH (kJ/mol) Temperature (K) Method Reference Comment
74.5318.AStephenson and Malanowski, 1987Based on data from 306. - 331. K.; AC

Enthalpy of fusion

ΔfusH (kJ/mol) Temperature (K) Method Reference Comment
15.0241.7DSCBadea, Blanco, et al., 2007AC

References

Aldrich Chemical Company Inc., 1990
Aldrich Chemical Company Inc., Catalog Handbook of Fine Chemicals, Aldrich Chemical Company, Inc., Milwaukee WI, 1990, 1. [all data]

Stephenson and Malanowski, 1987
Stephenson, Richard M.; Malanowski, Stanislaw, Handbook of the Thermodynamics of Organic Compounds, 1987, https://doi.org/10.1007/978-94-009-3173-2 . [all data]

Badea, Blanco, et al., 2007
Badea, Elena; Blanco, Ignazio; Della Gatta, Giuseppe, Fusion and solid-to-solid transitions of a homologous series of alkane-α,ω-dinitriles, The Journal of Chemical Thermodynamics, 2007, 39, 10, 1392-1398, https://doi.org/10.1016/j.jct.2007.03.005 . [all data]