4-Piperidinemethanol
- Formula: C6H13NO
- Molecular weight: 115.1735
- IUPAC Standard InChIKey: XBXHCBLBYQEYTI-UHFFFAOYSA-N
- CAS Registry Number: 6457-49-4
- Chemical structure:
View 3d structure (requires JavaScript / HTML 5) - Other names: piperidin-4-ylmethanol

Phase change data

Data compiled by: William E. Acree, Jr., James S. Chickos
Quantity | Value | Units | Method | Reference | Comment |
---|---|---|---|---|---|
ΔsubH° | 98.3 ± 0.7 | kJ/mol | C | Ribeiro da Silva and Cabral, 2006 |

References

Ribeiro da Silva and Cabral, 2006
Ribeiro da Silva, Manuel A.V.; Cabral, Joana I.T.A.,
Standard molar enthalpies of formation of 2-, 3-, and 4-piperidinomethanol isomers,
The Journal of Chemical Thermodynamics, 2006, 38, 8, 1008-1012, https://doi.org/10.1016/j.jct.2005.10.014
. [all data]