Phenol, 4-propyl-
- Formula: C9H12O
- Molecular weight: 136.1910
- IUPAC Standard InChIKey: KLSLBUSXWBJMEC-UHFFFAOYSA-N
- CAS Registry Number: 645-56-7
- Chemical structure:
View 3d structure (requires JavaScript / HTML 5) - Species with the same structure:
- Other names: Phenol, p-propyl-; p-Hydroxypropylbenzene; p-Propylphenol; Dihydrochavicol; 4-Propylphenol; 4-n-Propylphenol; p-n-Propylphenol; 1-Hydroxy-4-n-propylbenzene; NSC 65647

Phase change data

Data compiled as indicated in comments:
BS - Robert L. Brown and Stephen E. Stein
TRC - Thermodynamics Research Center, NIST Boulder Laboratories, Chris Muzny director
AC - William E. Acree, Jr., James S. Chickos
Quantity | Value | Units | Method | Reference | Comment |
---|---|---|---|---|---|
Tboil | 505. ± 4. | K | AVG | N/A | Average of 8 values; Individual data points |
Quantity | Value | Units | Method | Reference | Comment |
Tfus | 295. ± 2. | K | AVG | N/A | Average of 7 values; Individual data points |
Enthalpy of vaporization
ΔvapH (kJ/mol) | Temperature (K) | Method | Reference | Comment |
---|---|---|---|---|
56.7 | 398. | A | Stephenson and Malanowski, 1987 | Based on data from 383. to 508. K.; AC |
61.3 | 348. | N/A | Stage, Müller, et al., 1953 | Based on data from 347. to 517. K.; AC |
59.5 | 373. | N/A | Stage, Müller, et al., 1953 | Based on data from 347. to 517. K.; AC |
58.4 | 398. | N/A | Stage, Müller, et al., 1953 | Based on data from 347. to 517. K.; AC |
56.2 | 423. | N/A | Stage, Müller, et al., 1953 | Based on data from 347. to 517. K.; AC |
51.5 | 473. | N/A | Stage, Müller, et al., 1953 | Based on data from 347. to 517. K.; AC |

Van Den Dool and Kratz RI, non-polar column, custom temperature program

Data compiled by: NIST Mass Spectrometry Data Center, William E. Wallace, director

Column type CapillaryCapillaryCapillaryCapillary
Active phase HP-5MSVF-5MSVF-5MSVF-5MS
Column length (m) 30.50.50.50.
Carrier gas HeHeHeHe
Substrate
Column diameter (mm) 0.250.250.250.25
Phase thickness (μm) 0.250.250.250.25
Program 60C (1 min) => 5 C/min => 210C => 10 C/min => 280C (15 min)60C(2min) => 30C/min => 100C => 1C/min => 60C(2min) => 30C/min => 100C => 2C/min => 60C(2min) => 30C/min => 100C => 4C/min =>
I 1257.51259.91260.41261.7
ReferenceAndriamaharavo, 2014Mjøs, Meier, et al., 2006Mjøs, Meier, et al., 2006Mjøs, Meier, et al., 2006
Comment MSDC-RI MSDC-RI MSDC-RI MSDC-RI

References

Stephenson and Malanowski, 1987
Stephenson, Richard M.; Malanowski, Stanislaw,
Handbook of the Thermodynamics of Organic Compounds, 1987, https://doi.org/10.1007/978-94-009-3173-2
. [all data]
Stage, Müller, et al., 1953
Stage, H.; Müller, E.; Faldix, P.,
Erdol u Kohle, 1953, 6, 375. [all data]