N-nitroaniline
- Formula: C6H6N2O2
- Molecular weight: 138.1240
- IUPAC Standard InChIKey: VBEGHXKAFSLLGE-UHFFFAOYSA-N
- CAS Registry Number: 645-55-6
- Chemical structure:
View 3d structure (requires JavaScript / HTML 5) - Permanent link for this species. Use this link for bookmarking this species for future reference.

Phase change data

Data compiled by: Thermodynamics Research Center, NIST Boulder Laboratories, Chris Muzny director
Quantity | Value | Units | Method | Reference | Comment |
---|---|---|---|---|---|
Tfus | 319.15 | K | N/A | Bruhl, 1897 | Uncertainty assigned by TRC = 2. K |

References

Bruhl, 1897
Bruhl, J.W.,
Spectrochemistry of nitrogen containing compounds V,
Z. Phys. Chem., Stoechiom. Verwandtschaftsl., 1897, 22, 373. [all data]