Benzenepropanoyl chloride
- Formula: C9H9ClO
- Molecular weight: 168.620
- IUPAC Standard InChIKey: MFEILWXBDBCWKF-UHFFFAOYSA-N
- CAS Registry Number: 645-45-4
- Chemical structure:
View 3d structure (requires JavaScript / HTML 5) - Other names: Hydrocinnamoyl chloride; β-Phenylpropanoyl chloride; β-Phenylpropionyl chloride; Propionyl chloride, 3-phenyl-; 3-Phenylpropanoyl chloride; 3-Phenylpropionyl chloride; 3-Phenylpropionic acid chloride; Dihydrocinnamoyl chloride; Hydrocinnamyl chloride; NSC 2854

Phase change data

Data compiled by: Robert L. Brown and Stephen E. Stein
Reduced pressure boiling point
Tboil (K) | Pressure (bar) | Reference |
---|---|---|
380.2 | 0.015 | Aldrich Chemical Company Inc., 1990 |
389. to 390. | 0.020 | Frinton Laboratories Inc., 1986 |

Van Den Dool and Kratz RI, non-polar column, custom temperature program

Column type | Active phase | I | Reference | Comment |
---|---|---|---|---|
Capillary | VF-5MS | 1280.5 | Tret'yakov, 2007 | 30. m/0.25 mm/0.25 μm, He; Program: Multi-step temperature program; T(initial)=60C; T(final)=270C |

References

Aldrich Chemical Company Inc., 1990
Aldrich Chemical Company Inc.,
Catalog Handbook of Fine Chemicals, Aldrich Chemical Company, Inc., Milwaukee WI, 1990, 1. [all data]
Frinton Laboratories Inc., 1986
Frinton Laboratories Inc.,
Catalog Number 11, Frinton Laboratories Inc., Vineland, NJ, 1986, 99. [all data]
Tret'yakov, 2007
Tret'yakov, K.V.,
Retention Data. NIST Mass Spectrometry Data Center., NIST Mass Spectrometry Data Center, 2007. [all data]