Lead borate

Condensed phase thermochemistry data

Quantity Value Units Method Reference Comment
Δfsolid-4196.55kJ/molReviewChase, 1998Data last reviewed in March, 1965
Quantity Value Units Method Reference Comment
solid203.41J/mol*KReviewChase, 1998Data last reviewed in March, 1965

Solid Phase Heat Capacity (Shomate Equation)

Cp° = A + B*t + C*t2 + D*t3 + E/t2
H° − H°298.15= A*t + B*t2/2 + C*t3/3 + D*t4/4 − E/t + F − H
S° = A*ln(t) + B*t + C*t2/2 + D*t3/3 − E/(2*t2) + G
    Cp = heat capacity (J/mol*K)
    H° = standard enthalpy (kJ/mol)
    S° = standard entropy (J/mol*K)
    t = temperature (K) / 1000.

View plot Requires a JavaScript / HTML 5 canvas capable browser.

View table.

Temperature (K) 298. - 2000.
A -47.98964
B 1034.180
C -634.7756
D 129.4040
E 2.092612
F -4215.840
G -124.1606
H -4196.552
ReferenceChase, 1998
Comment Data last reviewed in March, 1965

References

Chase, 1998
Chase, M.W., Jr., NIST-JANAF Themochemical Tables, Fourth Edition, J. Phys. Chem. Ref. Data, Monograph 9, 1998, 1-1951. [all data]