Altretamine
- Formula: C9H18N6
- Molecular weight: 210.2794
- IUPAC Standard InChIKey: UUVWYPNAQBNQJQ-UHFFFAOYSA-N
- CAS Registry Number: 645-05-6
- Chemical structure:
View 3d structure (requires JavaScript / HTML 5) - Other names: 1,3,5-Triazine-2,4,6-triamine, N,N,N',N',N'',N''-hexamethyl-; Melamine, hexamethyl-; ENT 50852; Hemel; Hexamethylmelamine; HMM; NSC 13875; 2,4,6-Tris(Dimethylamino)-s-triazine; 2,4,6-Tris(dimethylamino)-1,3,5-triazine; s-Triazine, 2,4,6-tris(dimethylamino)-; Hexastat; HTM; HXM; NC 195; NCI-C50259; Hexalen; N,N,N',N',N'',N''-Hexamethyl-1,3,5-triazine-2,4,6-triamine; 1,3,5-tris(dimethylamino)-s-triazine

Phase change data

Data compiled as indicated in comments:
TRC - Thermodynamics Research Center, NIST Boulder Laboratories, Chris Muzny director
AC - William E. Acree, Jr., James S. Chickos
Quantity | Value | Units | Method | Reference | Comment |
---|---|---|---|---|---|
Tfus | 444.35 | K | N/A | Braxton and Rytting, 1989 | Uncertainty assigned by TRC = 1. K; TRC |
Enthalpy of fusion
ΔfusH (kcal/mol) | Temperature (K) | Method | Reference | Comment |
---|---|---|---|---|
5.500 | 444.4 | DSC | Acree, 1991 | AC |

References

Braxton and Rytting, 1989
Braxton, B.K.; Rytting, J.H.,
Solubilities and solution thermodynamics of several substituted melamines,
Thermochim. Acta, 1989, 154, 1, 27, https://doi.org/10.1016/0040-6031(89)87116-3
. [all data]
Acree, 1991
Acree, William E.,
Thermodynamic properties of organic compounds: enthalpy of fusion and melting point temperature compilation,
Thermochimica Acta, 1991, 189, 1, 37-56, https://doi.org/10.1016/0040-6031(91)87098-H
. [all data]