Benzene, 1-iodo-3-nitro-
- Formula: C6H4INO2
- Molecular weight: 249.0059
- IUPAC Standard InChIKey: CBYAZOKPJYBCHE-UHFFFAOYSA-N
- CAS Registry Number: 645-00-1
- Chemical structure:
View 3d structure (requires JavaScript / HTML 5) - Other names: 1-Iodo-3-nitrobenzene; 3-Iodonitrobenzene; m-Iodonitrobenzene

Phase change data

Data compiled as indicated in comments:
BS - Robert L. Brown and Stephen E. Stein
ALS - Hussein Y. Afeefy, Joel F. Liebman, and Stephen E. Stein
AC - William E. Acree, Jr., James S. Chickos
Quantity | Value | Units | Method | Reference | Comment |
---|---|---|---|---|---|
Tboil | 553.2 | K | N/A | Weast and Grasselli, 1989 | BS |
Reduced pressure boiling point
Tboil (K) | Pressure (bar) | Reference | Comment |
---|---|---|---|
426.2 | 0.019 | Weast and Grasselli, 1989 | BS |
Enthalpy of sublimation
ΔsubH (kJ/mol) | Temperature (K) | Method | Reference | Comment |
---|---|---|---|---|
83. ± 2. | 351. | V | Wolf and Weghofer, 1938 | ALS |
83.2 ± 1.2 | 300. | N/A | Trieschmann, 1935 | Based on data from 295. to 306. K. See also Wolf and Weghofer, 1938, 2 and Jones, 1960.; AC |

References

Weast and Grasselli, 1989
CRC Handbook of Data on Organic Compounds, 2nd Editon, Weast,R.C and Grasselli, J.G., ed(s)., CRC Press, Inc., Boca Raton, FL, 1989, 1. [all data]
Wolf and Weghofer, 1938
Wolf, K.L.; Weghofer, H.,
Uber sublimationswarmen,
Z. Phys. Chem., 1938, 39, 194-208. [all data]
Trieschmann, 1935
Trieschmann, H.G.,
, Ph.D. Dissertation, Inst. Fur Phys. Chem. and Electrochem. der Universitat Kiel, Germany, 1935. [all data]
Wolf and Weghofer, 1938, 2
Wolf, K.L.; Weghofer, H.Z.,
Z. Phys. Chem. Abt. B, 1938, 39, 194. [all data]
Jones, 1960
Jones, A.H.,
Sublimation Pressure Data for Organic Compounds.,
J. Chem. Eng. Data, 1960, 5, 2, 196-200, https://doi.org/10.1021/je60006a019
. [all data]