Pyridine, 2-(1-methylethyl)-
- Formula: C8H11N
- Molecular weight: 121.1796
- IUPAC Standard InChIKey: PFYPDUUXDADWKC-UHFFFAOYSA-N
- CAS Registry Number: 644-98-4
- Chemical structure:
View 3d structure (requires JavaScript / HTML 5) - Species with the same structure:
- Other names: 2-Isopropylpyridine

Phase change data

Data compiled by: Robert L. Brown and Stephen E. Stein
Quantity | Value | Units | Method | Reference | Comment |
---|---|---|---|---|---|
Tboil | 433.0 | K | N/A | Weast and Grasselli, 1989 |

Ion clustering data

Data compiled by: Michael M. Meot-Ner (Mautner) and Sharon G. Lias
Clustering reactions
By formula: C8H12N+ + C8H11N = (C8H12N+ • C8H11N)
Quantity | Value | Units | Method | Reference | Comment |
---|---|---|---|---|---|
ΔrH° | 96.2 | kJ/mol | PHPMS | Meot-Ner M. and Sieck, 1983 | gas phase |
Quantity | Value | Units | Method | Reference | Comment |
ΔrS° | 137. | J/mol*K | PHPMS | Meot-Ner M. and Sieck, 1983 | gas phase |

Reaction thermochemistry data

Data compiled by: Michael M. Meot-Ner (Mautner) and Sharon G. Lias
Individual Reactions
By formula: C8H12N+ + C8H11N = (C8H12N+ • C8H11N)
Quantity | Value | Units | Method | Reference | Comment |
---|---|---|---|---|---|
ΔrH° | 23.0 | kcal/mol | PHPMS | Meot-Ner M. and Sieck, 1983 | gas phase |
Quantity | Value | Units | Method | Reference | Comment |
ΔrS° | 32.7 | cal/mol*K | PHPMS | Meot-Ner M. and Sieck, 1983 | gas phase |

References

Weast and Grasselli, 1989
CRC Handbook of Data on Organic Compounds, 2nd Editon, Weast,R.C and Grasselli, J.G., ed(s)., CRC Press, Inc., Boca Raton, FL, 1989, 1. [all data]
Meot-Ner M. and Sieck, 1983
Meot-Ner M.; Sieck, L.W.,
The Ionic Hydrogen Bond. 1. Sterically Hindered Bonds. Solvation and Clustering of Sterically Hindered Amines and Pyridines,
J. Am. Chem. Soc., 1983, 105, 10, 2956, https://doi.org/10.1021/ja00348a005
. [all data]