(Z)-2-Heptene
- Formula: C7H14
- Molecular weight: 98.1861
- IUPAC Standard InChIKey: OTTZHAVKAVGASB-HYXAFXHYSA-N
- CAS Registry Number: 6443-92-1
- Chemical structure:
View 3d structure (requires JavaScript / HTML 5) - Stereoisomers:
- Other names: (Z)-2-C7H14; cis-2-Heptene; 2-Heptene, (Z)-; (Z)-hept-2-ene

Gas phase thermochemistry data

Data compiled by: Donald R. Burgess, Jr.
Quantity | Value | Units | Method | Reference | Comment |
---|---|---|---|---|---|
ΔfH°gas | -70.7 | kJ/mol | N/A | Wiberg, Wasserman, et al., 1984 | Value computed using ΔfHliquid° value of -105.9±0.63 kj/mol from Wiberg, Wasserman, et al., 1984 and ΔvapH° value of 35.2 kj/mol from alkenes correlation. |
ΔfH°gas | -69.6 ± 0.7 | kJ/mol | Eqk | Wiberg, Wasserman, et al., 1984 | Value computed using ΔfHliquid° from Wiberg, Wasserman, et al., 1984 and ΔvapH° value of 36.3 kJ/mol from Steele and Chirico, 1993. |
ΔfH°gas | -69.9 | kJ/mol | N/A | Good, 1976 | Value computed using ΔfHliquid° value of -105.1±0.92 kj/mol from Good, 1976 and ΔvapH° value of 35.2 kj/mol from alkenes correlation. |
ΔfH°gas | -68.8 ± 1.0 | kJ/mol | Ccb | Good, 1976 | Value computed using ΔfHliquid° from Good, 1976 and ΔvapH° value of 36.3 kJ/mol from Steele and Chirico, 1993. |

Condensed phase thermochemistry data

Data compiled by: Hussein Y. Afeefy, Joel F. Liebman, and Stephen E. Stein
Quantity | Value | Units | Method | Reference | Comment |
---|---|---|---|---|---|
ΔfH°liquid | -105.9 ± 0.63 | kJ/mol | Eqk | Wiberg, Wasserman, et al., 1984 | Trifluoroacetolysis, hrxn[kcal/mol]=-9.827±0.021 |
ΔfH°liquid | -105.1 ± 0.92 | kJ/mol | Ccb | Good, 1976 | |
Quantity | Value | Units | Method | Reference | Comment |
ΔcH°liquid | -4650.22 ± 0.79 | kJ/mol | Ccb | Good, 1976 | Corresponding ΔfHºliquid = -105.1 kJ/mol (simple calculation by NIST; no Washburn corrections) |

Phase change data

Data compiled as indicated in comments:
BS - Robert L. Brown and Stephen E. Stein
TRC - Thermodynamics Research Center, NIST Boulder Laboratories, Chris Muzny director
AC - William E. Acree, Jr., James S. Chickos
Quantity | Value | Units | Method | Reference | Comment |
---|---|---|---|---|---|
Tboil | 372. ± 2. | K | AVG | N/A | Average of 12 values; Individual data points |
Quantity | Value | Units | Method | Reference | Comment |
ΔvapH° | 38.6 | kJ/mol | GS | Verevkin, Wandschneider, et al., 2000 | Based on data from 276. to 304. K.; AC |
ΔvapH° | 36.0 | kJ/mol | N/A | Reid, 1972 | AC |
Enthalpy of vaporization
ΔvapH (kJ/mol) | Temperature (K) | Method | Reference | Comment |
---|---|---|---|---|
39.0 ± 0.3 | 290. | GS | Verevkin, Wandschneider, et al., 2000 | Based on data from 276. to 304. K.; AC |
35.3 | 330. | A | Stephenson and Malanowski, 1987 | Based on data from 315. to 372. K.; AC |
34.6 | 347. | N/A | Eisen and Orav, 1970 | Based on data from 332. to 371. K. See also Boublik, Fried, et al., 1984.; AC |

Reaction thermochemistry data

Data compiled by: Hussein Y. Afeefy, Joel F. Liebman, and Stephen E. Stein
Individual Reactions
By formula: H2 + C7H14 = C7H16
Quantity | Value | Units | Method | Reference | Comment |
---|---|---|---|---|---|
ΔrH° | -115.6 ± 0.4 | kJ/mol | Chyd | Rogers and Dejroongruang, 1988 | liquid phase; solvent: Hydrocarbone |
By formula: C7H14 = C7H14
Quantity | Value | Units | Method | Reference | Comment |
---|---|---|---|---|---|
ΔrH° | -4. | kJ/mol | Ciso | Strohmeier and Rehder-Stirnweiss, 1970 | liquid phase; Isomerization over RhH(CO)(PPh3)3 |
By formula: C7H14 = C7H14
Quantity | Value | Units | Method | Reference | Comment |
---|---|---|---|---|---|
ΔrH° | -7.6 ± 0.1 | kJ/mol | Eqk | Kabo, Andreevskii, et al., 1967 | gas phase; Heat of isomerization |

Kovats' RI, non-polar column, isothermal

Column type | Active phase | Temperature (C) | I | Reference | Comment |
---|---|---|---|---|---|
Capillary | Methyl Silicone | 30. | 712.8 | Soják, Addová, et al., 2002 | He; Column length: 150. m; Column diameter: 0.250 mm |
Capillary | Squalane | 30. | 702.1 | Soják, Addová, et al., 2002 | He; Column length: 93. m; Column diameter: 0.250 mm |
Capillary | Squalane | 100. | 705. | Heinzen, Soares, et al., 1999 | |
Capillary | BP-1 | 0. | 712. | Skrbic and Cvejanov, 1992 | 15. m/0.53 mm/1.0 μm, N2 |
Capillary | OV-101 | 40. | 713. | Laub and Purnell, 1988 | |
Capillary | OV-101 | 60. | 713. | Laub and Purnell, 1988 | |
Capillary | OV-101 | 80. | 713. | Laub and Purnell, 1988 | |
Capillary | DB-1 | 40. | 713. | Lubeck and Sutton, 1984 | 60. m/0.264 mm/0.25 μm, H2 |
Capillary | HP-PONA | 40. | 713. | Lubeck and Sutton, 1984 | 50. m/0.21 mm/0.5 μm, H2 |
Capillary | OV-1 | 50. | 712. | Anders, Scheller, et al., 1982 | Column length: 55. m; Column diameter: 0.21 mm |
Capillary | OV-1 | 60. | 712. | Nijs and Jacobs, 1981 | He; Column length: 150. m; Column diameter: 0.50 mm |
Capillary | Squalane | 100. | 705.9 | Lulova, Leont'eva, et al., 1976 | He; Column length: 120. m; Column diameter: 0.25 mm |
Capillary | Squalane | 100. | 704. | Lulova, Leont'eva, et al., 1976 | He; Column length: 120. m; Column diameter: 0.25 mm |
Capillary | Squalane | 100. | 700.4 | Lulova, Leont'eva, et al., 1976 | He; Column length: 120. m; Column diameter: 0.25 mm |
Capillary | Squalane | 55. | 704.4 | Lulova, Leont'eva, et al., 1975 | He; Column length: 120. m; Column diameter: 0.25 mm |
Capillary | Squalane | 100. | 705. | Sojak, Hrivnak, et al., 1973 | |
Capillary | Squalane | 115. | 705. | Sojak, Hrivnak, et al., 1973 | |
Capillary | Squalane | 86. | 704. | Sojak, Hrivnak, et al., 1973 | |
Capillary | Apiezon L | 100. | 713.2 | Eisen, Orav, et al., 1972 | Column length: 45. m; Column diameter: 0.25 mm |
Capillary | Squalane | 60. | 703.5 | Eisen, Orav, et al., 1972 | Column length: 80. m; Column diameter: 0.25 mm |
Capillary | Squalane | 60. | 704. | Orav and Eisen, 1972 | Column length: 80. m; Column diameter: 0.25 mm |
Capillary | Squalane | 115. | 705.1 | Soják and Bucinská, 1970 | N2; Column length: 200. m; Column diameter: 0.2 mm |
Capillary | Squalane | 86. | 704.3 | Soják and Bucinská, 1970 | N2; Column length: 200. m; Column diameter: 0.2 mm |
Capillary | Squalane | 40. | 700. | Matukuma, 1969 | N2; Column length: 91.4 m; Column diameter: 0.25 mm |
Packed | Squalane | 27. | 703. | Hively and Hinton, 1968 | He, Chromosorb P; Column length: 15. m; Column diameter: 0.25 mm |
Packed | Squalane | 49. | 704. | Hively and Hinton, 1968 | He, Chromosorb P; Column length: 15. m; Column diameter: 0.25 mm |
Packed | Squalane | 67. | 704. | Hively and Hinton, 1968 | He, Chromosorb P; Column length: 15. m; Column diameter: 0.25 mm |
Packed | Squalane | 86. | 704. | Hively and Hinton, 1968 | He, Chromosorb P; Column length: 15. m; Column diameter: 0.25 mm |

Kovats' RI, non-polar column, custom temperature program

Column type | Active phase | I | Reference | Comment |
---|---|---|---|---|
Capillary | Petrocol DH-100 | 708.8 | Haagen-Smit Laboratory, 1997 | He; Column length: 100. m; Column diameter: 0.2 mm; Program: 5C(10min) => 5C/min => 50C(48min) => 1.5C/min => 195C(91min) |

Kovats' RI, polar column, isothermal

Column type | Active phase | Temperature (C) | I | Reference | Comment |
---|---|---|---|---|---|
Capillary | PEG 4000 | 100. | 786. | Rang, Orav, et al., 1988 | |
Capillary | PEG 4000 | 110. | 790. | Rang, Orav, et al., 1988 | |
Capillary | PEG 4000 | 60. | 779. | Rang, Orav, et al., 1988 | |
Capillary | PEG 4000 | 70. | 781. | Rang, Orav, et al., 1988 | |
Capillary | PEG 4000 | 80. | 784. | Rang, Orav, et al., 1988 | |
Capillary | Polyethylene Glycol 4000 | 50. | 778.9 | Eisen, Orav, et al., 1972 | Column length: 80. m; Column diameter: 0.25 mm |
Capillary | Polyethylene Glycol 4000 | 60. | 778.7 | Eisen, Orav, et al., 1972 | Column length: 80. m; Column diameter: 0.25 mm |
Capillary | Polyethylene Glycol 4000 | 80. | 783.8 | Eisen, Orav, et al., 1972 | Column length: 80. m; Column diameter: 0.25 mm |
Capillary | PEG 4000 | 60. | 778.7 | Orav and Eisen, 1972 | Column length: 80. m; Column diameter: 0.25 mm |
Capillary | PEG 4000 | 50. | 778.9 | Orav and Eisen, 1972 | Column length: 80. m; Column diameter: 0.25 mm |
Capillary | PEG 4000 | 80. | 783.8 | Orav and Eisen, 1972 | Column length: 80. m; Column diameter: 0.25 mm |

Kovats' RI, polar column, temperature ramp

Column type | Active phase | I | Reference | Comment |
---|---|---|---|---|
Capillary | DB-Wax | 784. | Umano and Shibamoto, 1987 | He, 40. C @ 10. min, 2. K/min; Column length: 60. m; Column diameter: 0.25 mm; Tend: 200. C |

Van Den Dool and Kratz RI, non-polar column, temperature ramp

Column type | Active phase | I | Reference | Comment |
---|---|---|---|---|
Capillary | Methyl Silicone | 714.4 | Soják, Addová, et al., 2002 | He, 1. K/min; Column length: 150. m; Column diameter: 0.250 mm; Tstart: 30. C; Tend: 200. C |
Capillary | Petrocol DH | 710.92 | White, Douglas, et al., 1992 | 100. m/0.25 mm/0.5 μm, He, 1. K/min; Tstart: 30. C; Tend: 220. C |
Capillary | Petrocol DH | 710.93 | White, Douglas, et al., 1992 | 100. m/0.25 mm/0.5 μm, He, 1. K/min; Tstart: 30. C; Tend: 220. C |
Capillary | Petrocol DH | 711. | White, Hackett, et al., 1992 | 100. m/0.25 mm/0.5 μm, He, 1. K/min; Tstart: 30. C; Tend: 220. C |
Capillary | HP-1 | 713.2 | Bangjie, Xijian, et al., 1987 | N2, 10. K/min; Column length: 25. m; Column diameter: 0.2 mm; Tstart: 30. C |
Capillary | HP-1 | 712.2 | Bangjie, Xijian, et al., 1987 | N2, 2. K/min; Column length: 25. m; Column diameter: 0.2 mm; Tstart: 30. C |
Capillary | HP-1 | 712.1 | Bangjie, Xijian, et al., 1987 | N2, 30. C @ 5. min, 5. K/min; Column length: 25. m; Column diameter: 0.2 mm |

Van Den Dool and Kratz RI, non-polar column, custom temperature program

Column type | Active phase | I | Reference | Comment |
---|---|---|---|---|
Capillary | DB-5 | 712. | Zaikin and Borisov, 2002 | He; Column length: 30. m; Column diameter: 0.25 mm; Program: 30C => 5K/min=120C => 10C/min => 270C |

Van Den Dool and Kratz RI, polar column, temperature ramp

Column type | Active phase | I | Reference | Comment |
---|---|---|---|---|
Capillary | DB-Wax | 760. | Chung, Eiserich, et al., 1994 | He, 60. C @ 4. min, 3. K/min, 220. C @ 30. min; Column length: 60. m; Column diameter: 0.25 mm |

Normal alkane RI, non-polar column, isothermal

Column type | Active phase | Temperature (C) | I | Reference | Comment |
---|---|---|---|---|---|
Capillary | Squalane | 40. | 702.4 | Sojak, Addova, et al., 2000 | He; Column length: 93. m; Column diameter: 0.25 mm |

Normal alkane RI, non-polar column, temperature ramp

Column type | Active phase | I | Reference | Comment |
---|---|---|---|---|
Capillary | Polydimethyl siloxane: CP-Sil 5 CB | 714. | Bramston-Cook, 2013 | 60. m/0.25 mm/1.0 μm, Helium, 45. C @ 1.45 min, 3.6 K/min, 210. C @ 2.72 min |
Capillary | Petrocol DH | 710. | Supelco, 2012 | 100. m/0.25 mm/0.50 μm, Helium, 20. C @ 15. min, 15. K/min, 220. C @ 30. min |
Capillary | OV-101 | 713. | Orav, Kailas, et al., 1999 | 50. m/0.20 mm/0.50 μm, Helium, 30. C @ 6. min, 1. K/min; Tend: 100. C |
Capillary | DB-1 | 712. | Ramnas, Ostermark, et al., 1994 | 50. m/0.32 mm/1.0 μm, He, 2. K/min; Tstart: -20. C |
Capillary | DB-5 | 709. | Macku and Shibamoto, 1991 | He, 40. C @ 5. min, 2. K/min; Column length: 60. m; Column diameter: 0.25 mm; Tend: 160. C |
Capillary | OV-101 | 710. | Zenkevich and Ventura, 1991 | Helium, 50. C @ 0. min, 5. K/min, 240. C @ 0. min; Column length: 54. m; Column diameter: 0.26 mm |
Capillary | SE-30 | 711. | Hackett, Gibbon, et al., 1985 | He, 20. C @ 4. min, 2. K/min, 260. C @ 16. min; Column length: 50. m; Column diameter: 0.25 mm |

Normal alkane RI, non-polar column, custom temperature program

Column type | Active phase | I | Reference | Comment |
---|---|---|---|---|
Capillary | Polydimethyl siloxane | 705. | Junkes, Castanho, et al., 2003 | Program: not specified |
Capillary | DB-1 | 713. | Zhu and Wang, 2001 | Program: not specified |
Capillary | Methyl Silicone | 709. | Spieksma, 1999 | Program: not specified |
Packed | SE-30 | 715. | Robinson and Odell, 1971 | N2, Chromosorb W; Column length: 6.1 m; Program: 50C910min) => 20C/min => 90(6min) => 10C/min => 150C(hold) |
Packed | Squalane | 700. | Robinson and Odell, 1971 | N2, Embacel; Column length: 3.0 m; Program: 25C(5min) => 2C/min => 35 => 4C/min => 95C(hold) |

References

Wiberg, Wasserman, et al., 1984
Wiberg, K.B.; Wasserman, D.J.; Martin, E.,
Enthalpies of hydration of alkenes. 2. The n-heptenes and n-pentenes,
J. Phys. Chem., 1984, 88, 3684-3688. [all data]
Steele and Chirico, 1993
Steele, W.V.; Chirico, R.D.,
Thermodynamic properties of alkenes (mono-olefins larger than C4),
J. Phys. Chem. Ref. Data, 1993, 22, 377-430. [all data]
Good, 1976
Good, W.D.,
The enthalpies of formation of five isomeric heptenes,
J. Chem. Thermodyn., 1976, 8, 67-71. [all data]
Verevkin, Wandschneider, et al., 2000
Verevkin, Sergey P.; Wandschneider, Dirk; Heintz, Andreas,
Determination of Vaporization Enthalpies of Selected Linear and Branched C 7 , C 8 , C 9 , C 11 , and C 12 Monoolefin Hydrocarbons from Transpiration and Correlation Gas-Chromatography Methods,
J. Chem. Eng. Data, 2000, 45, 4, 618-625, https://doi.org/10.1021/je990297k
. [all data]
Reid, 1972
Reid, Robert C.,
Handbook on vapor pressure and heats of vaporization of hydrocarbons and related compounds, R. C. Wilhort and B. J. Zwolinski, Texas A Research Foundation. College Station, Texas(1971). 329 pages.$10.00,
AIChE J., 1972, 18, 6, 1278-1278, https://doi.org/10.1002/aic.690180637
. [all data]
Stephenson and Malanowski, 1987
Stephenson, Richard M.; Malanowski, Stanislaw,
Handbook of the Thermodynamics of Organic Compounds, 1987, https://doi.org/10.1007/978-94-009-3173-2
. [all data]
Eisen and Orav, 1970
Eisen, O.; Orav, A.,
Eesti NSV Tead. Akad. Toim. Keem. Geol., 1970, 19, 3, 202. [all data]
Boublik, Fried, et al., 1984
Boublik, T.; Fried, V.; Hala, E.,
The Vapour Pressures of Pure Substances: Selected Values of the Temperature Dependence of the Vapour Pressures of Some Pure Substances in the Normal and Low Pressure Region, 2nd ed., Elsevier, New York, 1984, 972. [all data]
Rogers and Dejroongruang, 1988
Rogers, D.W.; Dejroongruang, K.,
Enthalpies of hydrogenation of the n-heptenes and the methylhexenes,
J. Chem. Thermodyn., 1988, 20, 675-680. [all data]
Strohmeier and Rehder-Stirnweiss, 1970
Strohmeier, W.; Rehder-Stirnweiss, W.,
Isomerization of heptene over RhH(CO)(PPh3)3,
J. Organomet. Chem., 1970, 22, 27-28. [all data]
Kabo, Andreevskii, et al., 1967
Kabo, G.Ya.; Andreevskii, D.N.; Savinetskaya, G.A.,
Isomerization equilibrium of n-monochloroheptanes and n-heptenes,
Neftekhimiya, 1967, 7, 364-368. [all data]
Soják, Addová, et al., 2002
Soják, L.; Addová, G.; Kubinec, R.; Kraus, A.; Hu, G.,
Gas chromatographic-mass spectrometric characterization of all acyclic C5-C7 alkenes from fluid catalytic cracked gasoline using polydimethylsiloxane and squalane stationary phases,
J. Chromatogr. A, 2002, 947, 1, 103-117, https://doi.org/10.1016/S0021-9673(01)01564-3
. [all data]
Heinzen, Soares, et al., 1999
Heinzen, V.E.F.; Soares, M.F.; Yunes, R.A.,
Semi-empirical topological method for the prediction of the chromatographic retention of cis- and trans-alkene isomers and alkanes,
J. Chromatogr. A, 1999, 849, 2, 495-506, https://doi.org/10.1016/S0021-9673(99)00530-0
. [all data]
Skrbic and Cvejanov, 1992
Skrbic, B.D.; Cvejanov, J.Dj.,
Unified retention indices of hydrocarbons on BP-1 dimethylsiloxane stationary phase,
Chromatographia, 1992, 34, 1/2, 83-84, https://doi.org/10.1007/BF02290465
. [all data]
Laub and Purnell, 1988
Laub, R.J.; Purnell, J.H.,
Specific retention volumes, retention indices, and family-plot regressions of aliphatic, alicyclic, and aromatic hydrocarbon solutes with OV-101 poly (dimethylsiloxane) stationary phase,
J. Hi. Res. Chromatogr. Chromatogr. Comm., 1988, 11, 9, 649-660, https://doi.org/10.1002/jhrc.1240110908
. [all data]
Lubeck and Sutton, 1984
Lubeck, A.J.; Sutton, D.L.,
Kovats Retention Indices of Selected Olefins on Bonded Phase Fused Silica Capillaries,
J. Hi. Res. Chromatogr. Chromatogr. Comm., 1984, 7, 9, 542-544, https://doi.org/10.1002/jhrc.1240070913
. [all data]
Anders, Scheller, et al., 1982
Anders, G.; Scheller, M.; Schuhler, C.; Struppe, H.G.,
Zur Vorausberechnung von Bruttoretentioszeiten bei temperaturprogramierter Gaschromatographie mit Hilfe isotherm bestimmter Retentionsindices und einer Anpassung an experimentelle Retentionszeiten,
Chromatographia, 1982, 15, 1, 43-47, https://doi.org/10.1007/BF02269039
. [all data]
Nijs and Jacobs, 1981
Nijs, H.H.; Jacobs, P.A.,
On-Line Single Run Analysis of Effluents from a Fischer-Tropsch Reactor,
J. Chromatogr. Sci., 1981, 19, 1, 40-45, https://doi.org/10.1093/chromsci/19.1.40
. [all data]
Lulova, Leont'eva, et al., 1976
Lulova, N.I.; Leont'eva, S.A.; Timofeeva, A.N.,
Gas-chromatographic method of determination of individual hydrocarbons in catalytic cracking gasolines
in Proceedings of All-Union Research Institute on Oil Processes. Vol.18, All-Union Research Institute on Oil Processes, Moscow, 1976, 30-53. [all data]
Lulova, Leont'eva, et al., 1975
Lulova, N.I.; Leont'eva, S.A.; Fedosova, A.K.; Kvasova, V.A.,
Individual composition of hydrocarbons in naphthas from secondary processes,
Chem. Technol. Fuels Oils (Engl. Transl.), 1975, 11, 1/2, 59-64, https://doi.org/10.1007/BF00717315
. [all data]
Sojak, Hrivnak, et al., 1973
Sojak, L.; Hrivnak, J.; Majer, P.; Janak, J.,
Capillary Gas Chromatography of Linear Alkenes on Squalane,
Anal. Chem., 1973, 45, 2, 293-302, https://doi.org/10.1021/ac60324a039
. [all data]
Eisen, Orav, et al., 1972
Eisen, O.; Orav, A.; Rang, S.,
Identifizierung von Normal-Alkenen, Cyclopentenen und -Hexenen mittels Kapillar-Gas-Chromatographie. Identification des alcènes, cyclopentènes et -hexènes à l'aide de la chromatogrpahie en phase gazeuse sur colonne capillaire,
Chromatographia, 1972, 5, 11, 229-239, https://doi.org/10.1007/BF02270600
. [all data]
Orav and Eisen, 1972
Orav, A.; Eisen, O.,
The retention indexes for alkenes, alkynes and cyclenes on capillary columns,
Izv. Akad. Nauk Est. SSR, Khim. Geol., 1972, 21, 1, 39-47. [all data]
Soják and Bucinská, 1970
Soják, L.; Bucinská, A.,
Open tubular column gas chromatography of dehydrogenation products of C6-C10 n-alkanes. Separation and identification of mixtures of C6-C10 straight-chain alkanes, alkenes and aromatics,
J. Chromatogr., 1970, 51, 75-82, https://doi.org/10.1016/S0021-9673(01)96841-4
. [all data]
Matukuma, 1969
Matukuma, A.,
Retention indices of alkanes through C10 and alkenes through C8 and relation between boiling points and retention data,
Gas Chromatogr., Int. Symp. Anal. Instrum. Div Instrum Soc. Amer., 1969, 7, 55-75. [all data]
Hively and Hinton, 1968
Hively, R.A.; Hinton, R.E.,
Variation of the retention index with temperature on squalane substrates,
J. Gas Chromatogr., 1968, 6, 4, 203-217, https://doi.org/10.1093/chromsci/6.4.203
. [all data]
Haagen-Smit Laboratory, 1997
Haagen-Smit Laboratory,
Procedure for the detailed hydrocarbon analysis of gasolines by single column high efficiency (capillary) column gas chromatography, SOP NO. MLD 118, Revision No. 1.1, California Environmental Protection Agency, Air Resources Board, El Monte, California, 1997, 22. [all data]
Rang, Orav, et al., 1988
Rang, S.A.; Orav, A.E.; Kuningas, K.R.; Meister, A.E.; Strense, T.V.; Eisen, O.G.,
Gas-Chromatographic Characteristics of unsaturated hydrocarbons, Academy of Sciences of Estonia SSR, Tallinn, Estonia SSR, 1988, 208. [all data]
Umano and Shibamoto, 1987
Umano, K.; Shibamoto, T.,
Analysis of headspace volatiles from overheated beef fat,
J. Agric. Food Chem., 1987, 35, 1, 14-18, https://doi.org/10.1021/jf00073a004
. [all data]
White, Douglas, et al., 1992
White, C.M.; Douglas, L.J.; Hackett, J.P.; Anderson, R.R.,
Characterization of synthetic gasoline from the chloromethane-zeolite reaction,
Energy Fuels, 1992, 6, 1, 76-82, https://doi.org/10.1021/ef00031a012
. [all data]
White, Hackett, et al., 1992
White, C.M.; Hackett, J.; Anderson, R.R.; Kail, S.; Spock, P.S.,
Linear temperature programmed retention indices of gasoline range hydrocarbons and chlorinated hydrocarbons on cross-linked polydimethylsiloxane,
J. Hi. Res. Chromatogr., 1992, 15, 2, 105-120, https://doi.org/10.1002/jhrc.1240150211
. [all data]
Bangjie, Xijian, et al., 1987
Bangjie, C.; Xijian, G.; Shaoyi, P.,
Calculation of retention indices in temperature-programmed gas chromatography,
Chromatographia, 1987, 23, 12, 888-892, https://doi.org/10.1007/BF02261466
. [all data]
Zaikin and Borisov, 2002
Zaikin, V.G.; Borisov, R.S.,
Chromatographic-mass spectrometric analysis of Fishcer-Tropsch synthesis products,
J. Anal. Chem. USSR (Engl. Transl.), 2002, 57, 6, 544-551. [all data]
Chung, Eiserich, et al., 1994
Chung, T.Y.; Eiserich, J.P.; Shibamoto, T.,
Volatile compounds produced from peanut oil heated with different amounts of cysteine,
J. Agric. Food Chem., 1994, 42, 8, 1743-1746, https://doi.org/10.1021/jf00044a032
. [all data]
Sojak, Addova, et al., 2000
Sojak, L.; Addova, G.; Kubinec, R.; Ruman, J.; Hu, G.,
GC-MS characterization of all acyclic C5-C7 alkenes from FCC gasoline using squalane stationary phase,
Petroleum and Coal, 2000, 42, 3-4, 188-194. [all data]
Bramston-Cook, 2013
Bramston-Cook, R.,
Kovats indices for C2-C13 hydrocarbons and selected oxygenated/halocarbons with 100 % dimethylpolysiloxane columns, 2013, retrieved from http://lotusinstruments.com/monographs/List .... [all data]
Supelco, 2012
Supelco, CatalogNo. 24160-U,
Petrocol DH Columns. Catalog No. 24160-U, 2012, retrieved from http://www.sigmaaldrich.com/etc/medialib/docs/Supelco/Datasheet/1/w97949.Par.0001.File.tmp/w97949.pdf. [all data]
Orav, Kailas, et al., 1999
Orav, A.; Kailas, T.; Muurisepp, M.; Kann, J.,
Composition of the oil from waste tires. 1. Fraction boiling at yp to 160 0C,
Proc. Estonian Acad. Sci. Chem., 1999, 48, 1, 30-39. [all data]
Ramnas, Ostermark, et al., 1994
Ramnas, O.; Ostermark, U.; Peterson, G.,
Characterization of sixty alkenes in a cat-cracked gasoline naphtha by gas chromatography,
Chromatographia, 1994, 38, 3/4, 222-226, https://doi.org/10.1007/BF02290340
. [all data]
Macku and Shibamoto, 1991
Macku, C.; Shibamoto, T.,
Volatile sulfur-containing compounds generated from the thermal interaction of corn oil and cysteine,
J. Agric. Food Chem., 1991, 39, 11, 1987-1989, https://doi.org/10.1021/jf00011a021
. [all data]
Zenkevich and Ventura, 1991
Zenkevich, I.G.; Ventura, K.,
Gas Chromatographic Identification of Volatile Products of Thermal Degradation of Bitumen,
Zh. Prikl. Khim. (Rus.), 1991, 9, 1974-1979. [all data]
Hackett, Gibbon, et al., 1985
Hackett, J.P.; Gibbon, G.A.; Feldman, J.A.,
Capillary Gas Chromatographic Characterization of Fischer-Tropsch Liquefaction Product Oils,
J. Chromatogr. Sci., 1985, 23, 7, 285-292, https://doi.org/10.1093/chromsci/23.7.285
. [all data]
Junkes, Castanho, et al., 2003
Junkes, B.S.; Castanho, R.D.M.; Amboni, C.; Yunes, R.A.; Heinzen, V.E.F.,
Semiempirical Topological Index: A Novel Molecular Descriptor for Quantitative Structure-Retention Relationship Studies,
Internet Electronic Journal of Molecular Design, 2003, 2, 1, 33-49. [all data]
Zhu and Wang, 2001
Zhu, X.; Wang, W.,
The relationship between partition coefficients of hydrocarbons and their retention indices,
Acta Scientific Circumstantiae, 2001, 21, 5, 631-633. [all data]
Spieksma, 1999
Spieksma, W.,
Determination of vapor liquid equilibrium from the Kovats retention index on dimethylsilicone using the Wilson mixing tool,
J. Hi. Res. Chromatogr., 1999, 22, 10, 565-588, https://doi.org/10.1002/(SICI)1521-4168(19991001)22:10<565::AID-JHRC565>3.0.CO;2-2
. [all data]
Robinson and Odell, 1971
Robinson, P.G.; Odell, A.L.,
A system of standard retention indices and its uses. The characterisation of stationary phases and the prediction of retention indices,
J. Chromatogr., 1971, 57, 1-10, https://doi.org/10.1016/0021-9673(71)80001-8
. [all data]