Phenol, 2-propyl-
- Formula: C9H12O
- Molecular weight: 136.1910
- IUPAC Standard InChIKey: LCHYEKKJCUJAKN-UHFFFAOYSA-N
- CAS Registry Number: 644-35-9
- Chemical structure:
View 3d structure (requires JavaScript / HTML 5) - Other names: Phenol, o-propyl-; o-Propylphenol; 2-Propylphenol; o-n-Propylphenol; 2-n-Propylphenol; 1-Hydroxy-2-n-propylbenzene

Phase change data

Data compiled as indicated in comments:
BS - Robert L. Brown and Stephen E. Stein
TRC - Thermodynamics Research Center, NIST Boulder Laboratories, Chris Muzny director
AC - William E. Acree, Jr., James S. Chickos
Quantity | Value | Units | Method | Reference | Comment |
---|---|---|---|---|---|
Tboil | 495. ± 4. | K | AVG | N/A | Average of 6 values; Individual data points |
Quantity | Value | Units | Method | Reference | Comment |
Tfus | 280.15 | K | N/A | Kruber, Raeithel, et al., 1955 | Uncertainty assigned by TRC = 2. K; TRC |
Tfus | 280.15 | K | N/A | von Terres, Gebert, et al., 1955 | Uncertainty assigned by TRC = 2. K; TRC |
Enthalpy of vaporization
ΔvapH (kJ/mol) | Temperature (K) | Method | Reference | Comment |
---|---|---|---|---|
56.9 | 392. | A | Stephenson and Malanowski, 1987 | Based on data from 377. to 495. K.; AC |
59.9 | 398. | N/A | Stage, Müller, et al., 1953 | Based on data from 381. to 504. K.; AC |
57.2 | 423. | N/A | Stage, Müller, et al., 1953 | Based on data from 381. to 504. K.; AC |
53.0 | 473. | N/A | Stage, Müller, et al., 1953 | Based on data from 381. to 504. K.; AC |
Antoine Equation Parameters
log10(P) = A − (B / (T + C))
P = vapor pressure (bar)
T = temperature (K)
View plot Requires a JavaScript / HTML 5 canvas capable browser.
Temperature (K) | A | B | C | Reference | Comment |
---|---|---|---|---|---|
377.5 to 494.7 | 2.68098 | 787.885 | -206.004 | von Terres, Gebert, et al., 1955, 2 | Coefficents calculated by NIST from author's data. |

Normal alkane RI, polar column, temperature ramp

Data compiled by: NIST Mass Spectrometry Data Center, William E. Wallace, director

Column type Capillary
Active phase DB-FFAP
Column length (m) 30.
Carrier gas Helium
Substrate
Column diameter (mm) 0.32
Phase thickness (μm) 0.25
Tstart (C) 40.
Tend (C) 230.
Heat rate (K/min) 8.
Initial hold (min) 2.
Final hold (min) 5.
I 2128.
ReferenceCzerny, Brueckner, et al., 2011
Comment MSDC-RI

References

Kruber, Raeithel, et al., 1955
Kruber, O.; Raeithel, A.; Grigoleit, G.,
Compounds Proved to Be Present in Coal Tar,
Erdoel Kohle, 1955, 8, 637. [all data]
von Terres, Gebert, et al., 1955
von Terres, E.; Gebert, F.; Hulsemann, H.; Petereit, H.; Toepsch, H.; Ruppert, W.,
Brennst.-Chem., 1955, 36, 272. [all data]
Stephenson and Malanowski, 1987
Stephenson, Richard M.; Malanowski, Stanislaw,
Handbook of the Thermodynamics of Organic Compounds, 1987, https://doi.org/10.1007/978-94-009-3173-2
. [all data]
Stage, Müller, et al., 1953
Stage, H.; Müller, E.; Faldix, P.,
Erdol u Kohle, 1953, 6, 375. [all data]
von Terres, Gebert, et al., 1955, 2
von Terres, E.; Gebert, F.; Hulsemann, H.; Petereit, H.; Toepsch, H.; Ruppert, W.,
Zur Kenntnis der physikalisch-chemischen Grundlagen der Gewinnung und Zerlegung der Phenolfraktionen von Steinkohlenteer und Braunkohlenschwelteer. IV. Mitteilung Die Dampfdrucke von Phenol und Phenolderivaten,
Brennst.-Chem., 1955, 36, 272-274. [all data]