Naphthacene, octadecahydro-
- Formula: C18H30
- Molecular weight: 246.4308
- IUPAC Standard InChIKey: WPIGRDGCRDIFME-UHFFFAOYSA-N
- CAS Registry Number: 64302-84-7
- Chemical structure:
View 3d structure (requires JavaScript / HTML 5) - Other names: Perhydro-2,3-benzanthracene; Perhydro-2,3-benzanthracene, # 1; Perhydro-2,3-benzanthracene, # 3; Perhydro-2,3-benzanthracene, # 2

Kovats' RI, non-polar column, isothermal

Column type | Active phase | Temperature (C) | I | Reference | Comment |
---|---|---|---|---|---|
Capillary | SE-30 | 175. | 1911. | Bredael, 1982 | Column length: 100. m; Column diameter: 0.5 mm |
Capillary | SE-30 | 175. | 1924. | Bredael, 1982 | Column length: 100. m; Column diameter: 0.5 mm |
Capillary | SE-30 | 175. | 1943. | Bredael, 1982 | Column length: 100. m; Column diameter: 0.5 mm |

References

Bredael, 1982
Bredael, P.,
Retention indices of hydrocarbons on SE-30,
J. Hi. Res. Chromatogr. Chromatogr. Comm., 1982, 5, 6, 325-328, https://doi.org/10.1002/jhrc.1240050610
. [all data]