1,2-Propanediol, dinitrate
- Formula: C3H6N2O6
- Molecular weight: 166.0895
- IUPAC Standard InChIKey: PSXCGTLGGVDWFU-UHFFFAOYSA-N
- CAS Registry Number: 6423-43-4
- Chemical structure:
View 3d structure (requires JavaScript / HTML 5) - Other names: Isopropylene nitrate; Propylene dinitrate; Propylene glycol dinitrate; Propylene nitrate; 1,2-Propylene glycol dinitrate; Propylene glycol 1,2-dinitrate; PGDN; 1,2-Propanediol, 1,2-dinitrate; NSC 62614; propane-1,2-diyl dinitrate

Condensed phase thermochemistry data

Data compiled by: Hussein Y. Afeefy, Joel F. Liebman, and Stephen E. Stein
Quantity | Value | Units | Method | Reference | Comment |
---|---|---|---|---|---|
ΔfH°solid | -296.9 ± 9.3 | kJ/mol | Ccr | Baroody, 1983 |

Phase change data

Data compiled by: William E. Acree, Jr., James S. Chickos
Enthalpy of vaporization
ΔvapH (kJ/mol) | Temperature (K) | Method | Reference | Comment |
---|---|---|---|---|
63.8 | 303. | A | Stephenson and Malanowski, 1987 | Based on data from 288. to 328. K. See also Dykyj, 1970. |

Normal alkane RI, non-polar column, temperature ramp

Column type | Active phase | I | Reference | Comment |
---|---|---|---|---|
Capillary | DB-1 | 1004. | Schneider and Ballschniter, 1996 | 40. C @ 3. min, 3. K/min; Tend: 250. C |

References

Baroody, 1983
Baroody, E.E.,
Heats of formation of propellant compounds (U), Rpt. NSWC-TR-83-250 by Naval Surface Weapons Center, Silver Spring, MD, 1983, 1-11. [all data]
Stephenson and Malanowski, 1987
Stephenson, Richard M.; Malanowski, Stanislaw,
Handbook of the Thermodynamics of Organic Compounds, 1987, https://doi.org/10.1007/978-94-009-3173-2
. [all data]
Dykyj, 1970
Dykyj, J.,
Petrochemica, 1970, 10, 2, 51. [all data]
Schneider and Ballschniter, 1996
Schneider, M.; Ballschniter, K.,
Separation of Diastereomeric and Enentiomeric Alkyl Nitrates - Systematic Approach to Chiral Discrimination on Cyclodextrin LIPODEX-D,
Chem. Eur. J., 1996, 2, 5, 539-544, https://doi.org/10.1002/chem.19960020513
. [all data]