9-Anthracenecarboxaldehyde
- Formula: C15H10O
- Molecular weight: 206.2393
- IUPAC Standard InChIKey: YMNKUHIVVMFOFO-UHFFFAOYSA-N
- CAS Registry Number: 642-31-9
- Chemical structure:
View 3d structure (requires JavaScript / HTML 5) - Other names: 9-Anthraldehyde; 9-Anthrylaldehyde; 9-Anthrylcarboxaldehyde; 9-Formylanthracene; Anthracene-9-carboxaldehyde; Anthracene-9-aldehyde; anthracene-9-carbaldehyde

Phase change data

Data compiled by: William E. Acree, Jr., James S. Chickos
Enthalpy of sublimation
ΔsubH (kcal/mol) | Temperature (K) | Method | Reference |
---|---|---|---|
24.04 ± 0.93 | 329. to 363. | ME | Goldfarb and Suuberg, 2008 |
Enthalpy of fusion
ΔfusH (kcal/mol) | Temperature (K) | Reference |
---|---|---|
4.209 | 377.2 | Guarini and Sarti-fantoni, 1969 |

Gas phase ion energetics data

Data compiled as indicated in comments:
LBLHLM - Sharon G. Lias, John E. Bartmess, Joel F. Liebman, John L. Holmes, Rhoda D. Levin, and W. Gary Mallard
LLK - Sharon G. Lias, Rhoda D. Levin, and Sherif A. Kafafi
B - John E. Bartmess

Electron affinity determinations

EA (eV) Method Reference Comment
1.31 ± 0.10TDEqHeinis, Chowdhury, et al., 1993ΔGea(423 K)= -29.0 kcal/mol ΔSea=-2.7; B
1.02 ± 0.13ECDWentworth and Chen, 1967B

Ionization energy determinations

IE (eV) Method Reference Comment
7.67PEKlasinc, Kovac, et al., 1983LBLHLM
7.69 ± 0.03PIPotapov, Kardash, et al., 1972LLK
7.67 ± 0.03PEKlasinc, Kovac, et al., 1978Vertical value; LLK

References

Goldfarb and Suuberg, 2008
Goldfarb, Jillian L.; Suuberg, Eric M.,
VAPOR PRESSURES AND THERMODYNAMICS OF OXYGEN-CONTAINING POLYCYCLIC AROMATIC HYDROCARBONS MEASURED USING KNUDSEN EFFUSION,
Environ Toxicol Chem, 2008, 27, 6, 1244, https://doi.org/10.1897/07-486.1
. [all data]
Guarini and Sarti-fantoni, 1969
Guarini, G.; Sarti-fantoni, P.,
Calorimetric Study on Some Anthracene Photodimers,
Molecular Crystals, 1969, 6, 3-4, 423-426, https://doi.org/10.1080/15421407008083478
. [all data]