Diethyl 4,4'-azoxydibenzoate

Phase change data

Data compiled by: Eugene S. Domalski and Elizabeth D. Hearing

Enthalpy of fusion

ΔfusH (kJ/mol) Temperature (K) Reference Comment
20.485386.9Spaght, Thomas, et al., 1932Crystal-liquid crystal transition.

Entropy of fusion

ΔfusS (J/mol*K) Temperature (K) Reference Comment
52.9386.9Spaght, Thomas, et al., 1932Crystal-liquid

Enthalpy of phase transition

ΔHtrs (kJ/mol) Temperature (K) Initial Phase Final Phase Reference Comment
5.439395.7liquidliquidSpaght, Thomas, et al., 1932

Entropy of phase transition

ΔStrs (J/mol*K) Temperature (K) Initial Phase Final Phase Reference Comment
13.7395.7liquid, Liquid crystalliquid, isotropicSpaght, Thomas, et al., 1932

Condensed phase thermochemistry data

Data compiled by: Eugene S. Domalski and Elizabeth D. Hearing

Constant pressure heat capacity of solid

Cp,solid (cal/mol*K) Temperature (K) Reference Comment
107.8303.Spaght, Thomas, et al., 1932T = 30 to 150°C.

References

Spaght, Thomas, et al., 1932
Spaght, M.E.; Thomas, S.B.; Parks, G.S., Some heat capacity data on organic compounds obtained with a radiation calorimeter, J. Phys. Chem., 1932, 36, 882-888. [all data]