2,5-Furnadione, 3-(1-methylethyl)-
- Formula: C7H8O3
- Molecular weight: 140.1366
- IUPAC Standard InChIKey: QSWLSAYLEATCSH-UHFFFAOYSA-N
- CAS Registry Number: 64198-15-8
- Chemical structure:
View 3d structure (requires JavaScript / HTML 5) - Permanent link for this species. Use this link for bookmarking this species for future reference.

Reaction thermochemistry data

Data compiled by: Hussein Y. Afeefy, Joel F. Liebman, and Stephen E. Stein
Individual Reactions
+
= C21H18O3
By formula: C14H10 + C7H8O3 = C21H18O3
Quantity | Value | Units | Method | Reference | Comment |
---|---|---|---|---|---|
ΔrH° | -87.5 | kJ/mol | Eqk | Lenz, Hegedus, et al., 1982 | liquid phase; solvent: 1,2,4-C6H3Cl3 |

References

Lenz, Hegedus, et al., 1982
Lenz, T.G.; Hegedus, L.S.; Vaughan, J.D.,
Liquid phase thermochemical energy conversion systems - an application of Diels-Alder chemistry,
Int. J. Energy Res., 1982, 6, 357-365. [all data]