CAS Reg. No. 64177-64-6
- CAS Registry Number: 64177-64-6

Reaction thermochemistry data

Data compiled by: John E. Bartmess
Individual Reactions
(CAS Reg. No. 64177-64-6 • 4294967295) +
= CAS Reg. No. 64177-64-6
By formula: (CAS Reg. No. 64177-64-6 • 4294967295Sn) + Sn = CAS Reg. No. 64177-64-6
Quantity | Value | Units | Method | Reference | Comment |
---|---|---|---|---|---|
ΔrH° | 263.6 ± 1.8 | kJ/mol | N/A | Ho, Polak, et al., 1992 | gas phase |

References

Ho, Polak, et al., 1992
Ho, J.; Polak, M.L.; Lineberger, W.C.,
Photoelectron Spectroscopy of Group-IV Heavy Metal Dimers - Sn2-, Pb2-, and SnPb-,
J. Chem. Phys., 1992, 96, 1, 144, https://doi.org/10.1063/1.462503
. [all data]