CAS Reg. No. 64177-62-4
- CAS Registry Number: 64177-62-4

Reaction thermochemistry data

Data compiled by: John E. Bartmess
Individual Reactions
(CAS Reg. No. 64177-62-4 • 4294967295) +
= CAS Reg. No. 64177-62-4
By formula: (CAS Reg. No. 64177-62-4 • 4294967295Sb) + Sb = CAS Reg. No. 64177-62-4
Quantity | Value | Units | Method | Reference | Comment |
---|---|---|---|---|---|
ΔrH° | 74.51 | kcal/mol | N/A | Polak, Gerber, et al., 1992 | gas phase |

References

Polak, Gerber, et al., 1992
Polak, M.L.; Gerber, G.; Ho, J.; Lineberger, W.C.,
Photoelectron Spectroscopy of Small Antimony Cluster Anions - Sb(-) Sb2(-), Sb3(-), and Sb4(-),
J. Chem. Phys., 1992, 97, 12, 8990, https://doi.org/10.1063/1.463326
. [all data]