1,3-Isobenzofurandione, 4-nitro-
- Formula: C8H3NO5
- Molecular weight: 193.1131
- IUPAC Standard InChIKey: ROFZMKDROVBLNY-UHFFFAOYSA-N
- CAS Registry Number: 641-70-3
- Chemical structure:
View 3d structure (requires JavaScript / HTML 5) - Other names: Phthalic anhydride, 3-nitro-; 3-Nitrophthalic anhydride

Phase change data

Data compiled as indicated in comments:
TRC - Thermodynamics Research Center, NIST Boulder Laboratories, Chris Muzny director
AC - William E. Acree, Jr., James S. Chickos
Quantity | Value | Units | Method | Reference | Comment |
---|---|---|---|---|---|
Tfus | 436.6 | K | N/A | Casellato, Vecchi, et al., 1977 | Uncertainty assigned by TRC = 0.1 K; TRC |
Enthalpy of fusion
ΔfusH (kJ/mol) | Temperature (K) | Method | Reference | Comment |
---|---|---|---|---|
18.4 | 436.2 | DSC | Casellato, Vecchi, et al., 1977, 2 | AC |

Gas phase ion energetics data

Data compiled by: John E. Bartmess
Electron affinity determinations
EA (eV) | Method | Reference | Comment |
---|---|---|---|
2.051 ± 0.087 | IMRE | Paul and Kebarle, 1989 | ΔGea(423 K) = -46.0±1 kcal/mol, ΔS(est) = -3±3 eu |

References

Casellato, Vecchi, et al., 1977
Casellato, F.; Vecchi, C.; Girelli, A.,
Differential scanning calorimetry study of charge-transfer complexes of polynuclear aromatic hydrocarbons with the asymmetric acceptors 3- and 4-nitrophthalic anhydride,
Thermochim. Acta, 1977, 21, 2, 195, https://doi.org/10.1016/0040-6031(77)85017-X
. [all data]
Casellato, Vecchi, et al., 1977, 2
Casellato, F.; Vecchi, C.; Girelli, A.,
Differential scanning calorimetry study of charge-transfer complexes of polynuclear aromatic hydrocarbons with the asymmetric acceptors 3- and 4-nitrophthalic anhydride,
Thermochimica Acta, 1977, 21, 2, 195-199, https://doi.org/10.1016/0040-6031(77)85017-X
. [all data]
Paul and Kebarle, 1989
Paul, G.; Kebarle, P.,
Electron Affinities of Cyclic Unsaturated Dicarbonyls: Maleic Anhydrides, Maleimides, and Cyclopentendione,
J. Am. Chem. Soc., 1989, 111, 2, 464, https://doi.org/10.1021/ja00184a009
. [all data]