1,2-Dihydroaceanthrylene
- Formula: C16H12
- Molecular weight: 204.2665
- IUPAC Standard InChIKey: XTAHYROJKCXMOF-UHFFFAOYSA-N
- CAS Registry Number: 641-48-5
- Chemical structure:
View 3d structure (requires JavaScript / HTML 5) - Permanent link for this species. Use this link for bookmarking this species for future reference.

Gas phase thermochemistry data

Data compiled by: Glushko Thermocenter, Russian Academy of Sciences, Moscow
Constant pressure heat capacity of gas
Cp,gas (J/mol*K) | Temperature (K) | Reference | Comment |
---|---|---|---|
45.62 | 50. | Dorofeeva O.V., 1989 | These statistically calculated values were obtained using force field approximation for polycyclic aromatic hydrocarbons to estimate the needed vibrational frequencies (see also [ Dorofeeva O.V., 1986, Moiseeva N.F., 1990]). These functions are reproduced in the reference book [ Frenkel M., 1994]. |
71.39 | 100. | ||
102.09 | 150. | ||
137.14 | 200. | ||
193.26 | 273.15 | ||
212.8 ± 1.5 | 298.15 | ||
214.24 | 300. | ||
288.23 | 400. | ||
350.65 | 500. | ||
400.89 | 600. | ||
441.23 | 700. | ||
474.00 | 800. | ||
500.99 | 900. | ||
523.47 | 1000. | ||
542.36 | 1100. | ||
558.33 | 1200. | ||
571.93 | 1300. | ||
583.56 | 1400. | ||
593.56 | 1500. |

References

Dorofeeva O.V., 1989
Dorofeeva O.V.,
Thermodynamic Properties of Gaseous Polycyclic Aromatic Hydrocarbons Containing Five-Membered Rings. Institute for High Temperatures, USSR Academy of Sciences, Preprint No.1-263 (in Russian), Moscow, 1989. [all data]
Dorofeeva O.V., 1986
Dorofeeva O.V.,
On calculation of thermodynamic properties of polycyclic aromatic hydrocarbons,
Thermochim. Acta, 1986, 102, 59-66. [all data]
Moiseeva N.F., 1990
Moiseeva N.F.,
Group additivity scheme for calculating the chemical thermodynamic properties of gaseous polycyclic aromatic hydrocarbons containing five-membered rings,
Thermochim. Acta, 1990, 168, 179-186. [all data]
Frenkel M., 1994
Frenkel M.,
Thermodynamics of Organic Compounds in the Gas State, Vol. I, II, Thermodynamics Research Center, College Station, Texas, 1994, 1994. [all data]