Ethyl acetoacetate ethylene acetal
- Formula: C8H14O4
- Molecular weight: 174.1944
- IUPAC Standard InChIKey: XWEOGMYZFCHQNT-UHFFFAOYSA-N
- CAS Registry Number: 6413-10-1
- Chemical structure:
View 3d structure (requires JavaScript / HTML 5) - Other names: 1,3-Dioxolane-2-acetic acid, 2-methyl-, ethyl ester; Ethyl acetoacetate ethylene ketal; Ethyl acetoacetate 3-ethylene acetal; Ethyl 2-methyl-1,3-dioxolane-2-acetate

Kovats' RI, non-polar column, isothermal

Column type | Active phase | Temperature (C) | I | Reference | Comment |
---|---|---|---|---|---|
Capillary | SE-30 | 100. | 1123.1 | Tudor, 1997 | 40. m/0.35 mm/0.35 μm |

References

Tudor, 1997
Tudor, E.,
Temperature dependence of the retention index for perfumery compounds on a SE-30 glass capillary column. I. Linear equations,
J. Chromatogr. A, 1997, 779, 1-2, 287-297, https://doi.org/10.1016/S0021-9673(97)00453-6
. [all data]