N,N,N-Triacetylamine
- Formula: C6H9NO3
- Molecular weight: 143.1406
- IUPAC Standard InChIKey: FQTCUKQMGGJRCU-UHFFFAOYSA-N
- CAS Registry Number: 641-06-5
- Chemical structure:
View 3d structure (requires JavaScript / HTML 5) - Permanent link for this species. Use this link for bookmarking this species for future reference.

Condensed phase thermochemistry data

Data compiled by: Hussein Y. Afeefy, Joel F. Liebman, and Stephen E. Stein
Quantity | Value | Units | Method | Reference | Comment |
---|---|---|---|---|---|
ΔfH°liquid | -610.49 ± 0.96 | kJ/mol | Cm | Hill and Wadso, 1968 | Reanalyzed by Pedley, Naylor, et al., 1986, Original value = -613.4 kJ/mol; Heat of hydrolysis |

Phase change data

Data compiled by: Hussein Y. Afeefy, Joel F. Liebman, and Stephen E. Stein
Quantity | Value | Units | Method | Reference | Comment |
---|---|---|---|---|---|
ΔvapH° | 60.42 ± 0.08 | kJ/mol | C | Hill and Wadso, 1968 | Heat of hydrolysis |

Reaction thermochemistry data

Data compiled by: Hussein Y. Afeefy, Joel F. Liebman, and Stephen E. Stein
Individual Reactions
By formula: C6H9NO3 + 2H2O = C2H5NO + 2C2H4O2
Quantity | Value | Units | Method | Reference | Comment |
---|---|---|---|---|---|
ΔrH° | -103.5 ± 0.08 | kJ/mol | Cm | Hill and Wadso, 1968 | liquid phase; Heat of hydrolysis |

References

Hill and Wadso, 1968
Hill, J.O.; Wadso, I.,
Some thermochemical properties of N,N,N-triacetylammonia,
Acta Chem. Scand., 1968, 22, 1590-1594. [all data]
Pedley, Naylor, et al., 1986
Pedley, J.B.; Naylor, R.D.; Kirby, S.P.,
Thermochemical Data of Organic Compounds, Chapman and Hall, New York, 1986, 1-792. [all data]