Benzenesulfonamide, N,4-dimethyl-
- Formula: C8H11NO2S
- Molecular weight: 185.243
- IUPAC Standard InChIKey: GWLOGZRVYXAHRE-UHFFFAOYSA-N
- CAS Registry Number: 640-61-9
- Chemical structure:
View 3d structure (requires JavaScript / HTML 5) - Other names: p-Toluenesulfonamide, N-methyl-; (p-Tolylsulfonyl)methylamine; p-Toluene-N-methylsulfonamide; N-Methyl-p-toluenesulfonamide; N,4-Dimethylbenzenesulfonamide; N-Methyl-para-toluenesulfonamide; N-Methyl-p-toluolsulfonamide; N-methyltoluene-4-sulphonamide

Van Den Dool and Kratz RI, non-polar column, temperature ramp

Column type | Active phase | I | Reference | Comment |
---|---|---|---|---|
Capillary | VF-5MS | 1705. | Todua, 2011 | 30. m/0.25 mm/0.25 μm, He; Tstart: 60. C; Tend: 270. C |

References

Todua, 2011
Todua, N.G.,
Retention Data. NIST Mass Spectrometry Data Center., NIST Mass Spectrometry Data Center, 2011. [all data]