Acetamide, 2-fluoro-
- Formula: C2H4FNO
- Molecular weight: 77.0577
- IUPAC Standard InChIKey: FVTWJXMFYOXOKK-UHFFFAOYSA-N
- CAS Registry Number: 640-19-7
- Chemical structure:
View 3d structure (requires JavaScript / HTML 5) - Other names: AFL 1081; Compound 1081; Fluorakil 100; Fluoroacetamide; Fluoroacetic acid amide; Fussol; Megatox; Monofluoroacetamide; 2-Fluoroacetamide; Fluoracetamide; Fluorkill; Fluoroakil 100; Yanock; Amid kyseliny fluoroctove; FAA; Navron; Rcra waste number P057; 1081

Condensed phase thermochemistry data

Data compiled by: Hussein Y. Afeefy, Joel F. Liebman, and Stephen E. Stein
Quantity | Value | Units | Method | Reference | Comment |
---|---|---|---|---|---|
ΔfH°solid | -496.64 | kJ/mol | Ccb | Swarts, 1909 | |
Quantity | Value | Units | Method | Reference | Comment |
ΔcH°solid | -1046. | kJ/mol | Ccb | Swarts, 1919 | Not corrected for CODATA value of ΔfH |
ΔcH°solid | -1038.6 | kJ/mol | Ccb | Swarts, 1909 |

References

Swarts, 1909
Swarts, M.F.,
Sur la chaleur de formation de quelquesuns compounds organiques fluords,
Recl. Trav. Chim. Pays-Bas, 1909, 28, 143-154. [all data]
Swarts, 1919
Swarts, F.,
Etudes thermochimiques sur les combinaisons organiques fluorees,
J. Chim. Phys., 1919, 17, 3-70. [all data]