(Racemic) 3-(2-propylphenoxy)-propane-1,2-diol

Phase change data

Data compiled by: William E. Acree, Jr., James S. Chickos

Enthalpy of fusion

ΔfusH (kcal/mol) Temperature (K) Method Reference
7.05326.5DSCBredikhin, Bredikhina, et al., 2008

References

Bredikhin, Bredikhina, et al., 2008
Bredikhin, Alexander A.; Bredikhina, Zemfira A.; Novikova, Victorina G.; Pashagin, Alexander V.; Zakharychev, Dmitry V.; Gubaidullin, Aidar T., Three different types of chirality-driven crystallization within the series of uniformly substituted phenyl glycerol ethers, Chirality, 2008, 20, 10, 1092-1103, https://doi.org/10.1002/chir.20648 . [all data]