Diethoxydiphenylmethane
- Formula: C17H20O2
- Molecular weight: 256.3395
- IUPAC Standard InChIKey: DVYLYYOKYXHQPB-UHFFFAOYSA-N
- CAS Registry Number: 6397-77-9
- Chemical structure:
View 3d structure (requires JavaScript / HTML 5) - Permanent link for this species. Use this link for bookmarking this species for future reference.

Phase change data

Data compiled by: William E. Acree, Jr., James S. Chickos
Quantity | Value | Units | Method | Reference | Comment |
---|---|---|---|---|---|
ΔsubH° | 97.1 ± 1.1 | kJ/mol | N/A | Verevkin, Peng, et al., 1998 |
Enthalpy of fusion
ΔfusH (kJ/mol) | Temperature (K) | Reference |
---|---|---|
19.9 | 323.2 | Verevkin, Peng, et al., 1998 |

References

Verevkin, Peng, et al., 1998
Verevkin, S.P.; Peng, W.-H.; Beckhaus, H.D.; Rücuardt, C.,
Geminal substituent effects. 16. Does the anomeric effect in ketals depend on the hybridization of the central carbon atom?,
Eur. J. Org. Chem., 1998, 11, 2323. [all data]