O-Mustard
- Formula: C8H16Cl2OS2
- Molecular weight: 263.248
- IUPAC Standard InChIKey: FWVCSXWHVOOTFJ-UHFFFAOYSA-N
- CAS Registry Number: 63918-89-8
- Chemical structure:
View 3d structure (requires JavaScript / HTML 5) - Other names: Bis(2-chloroethylthioethyl) ether; Ethane, 1,1'-oxybis(2-((2-chloroethyl)thio)-; Ether, bis(2-(2-chloroethylmercapto)ethyl); Ether, bis(2-chloroethylthioethyl); Bis(β-chloroethylthioethyl) ether; 2-2'-Di(3-chloroethylthio)-diethyl ether; Dimustard ether; bis-[(2-Chloroethylthio)ethy] ether; Agent T; NSC 58818; O-Mustard T

Van Den Dool and Kratz RI, non-polar column, temperature ramp

Column type | Active phase | I | Reference | Comment |
---|---|---|---|---|
Capillary | SE-54 | 1990. | Kostiainen, 2000 | 25. m/0.32 mm/0.25 μm, He, 40. C @ 1. min, 10. K/min, 280. C @ 10. min |
Capillary | DB-5 | 1987.8 | Hancock and Peters, 1991 | He, 50. C @ 2. min, 10. K/min; Column length: 15. m; Column diameter: 0.53 mm |
Capillary | DB-5 | 1982.6 | D'agostino and Provost, 1988 | 15. m/0.32 mm/0.25 μm, 50. C @ 2. min, 10. K/min, 300. C @ 5. min |
Capillary | DB-5 | 1982.6 | D'Agostino and Provost, 1985 | 15. m/0.32 mm/0.25 μm, He, 50. C @ 2. min, 10. K/min; Tend: 300. C |
Capillary | DB-5 | 1979.6 | D'Agostino and Provost, 1985 | 15. m/0.32 mm/0.25 μm, He, 50. C @ 2. min, 10. K/min, 300. C @ 5. min |

Van Den Dool and Kratz RI, polar column, temperature ramp

Column type | Active phase | I | Reference | Comment |
---|---|---|---|---|
Capillary | DB-Wax | 3040.3 | D'Agostino and Provost, 1985 | 15. m/0.32 mm/0.25 μm, He, 50. C @ 2. min, 10. K/min, 250. C @ 5. min |

Normal alkane RI, non-polar column, temperature ramp

Column type | Active phase | I | Reference | Comment |
---|---|---|---|---|
Capillary | DB-5 | 1974. | Hanaoka, Nomura, et al., 2006 | 30. m/0.32 mm/0.25 μm, He, 100. C @ 5. min, 10. K/min; Tend: 280. C |
Capillary | DB-5 | 1974. | Hanaoka, Nomura, et al., 2006 | 30. m/0.32 mm/0.25 μm, He, 100. C @ 5. min, 10. K/min; Tend: 280. C |

Normal alkane RI, non-polar column, custom temperature program

Column type | Active phase | I | Reference | Comment |
---|---|---|---|---|
Capillary | 5 % Phenyl methyl siloxane | 1990. | OPCW, 1997 | Program: not specified |

Normal alkane RI, polar column, custom temperature program

Column type | Active phase | I | Reference | Comment |
---|---|---|---|---|
Capillary | Carbowax 400, Carbowax 20M, Carbowax 1540, Carbowax 4000, Superox 06, PEG 20M, etc. | 3040. | Waggott and Davies, 1984 | Hydrogen; Column length: 50. m; Column diameter: 0.32 mm; Program: not specified |

References

Kostiainen, 2000
Kostiainen, O.,
Gas Chromatography in Screening of Chemicals Related to the Chemical Weapons Convention
in Encyclopedia of Analytical Chemistry, Meyers, R.A., ed(s)., John Wiley Sons Ltd, Chichester, 2000, 963-979. [all data]
Hancock and Peters, 1991
Hancock, J.R.; Peters, G.R.,
Retention index monitoring of compounds of chemical defence interest using thermal desorption gas chromatography,
J. Chromatogr., 1991, 538, 2, 249-257, https://doi.org/10.1016/S0021-9673(01)88845-2
. [all data]
D'agostino and Provost, 1988
D'agostino, P.A.; Provost, L.R.,
Gas chromatographic retention indices of sulphur vesicants and related compounds,
J. Chromatogr., 1988, 436, 399-411, https://doi.org/10.1016/S0021-9673(00)94599-0
. [all data]
D'Agostino and Provost, 1985
D'Agostino, P.A.; Provost, L.R.,
Gas chromatographic retention indices of chemical warfare agents and simulants,
J. Chromatogr., 1985, 331, 47-54, https://doi.org/10.1016/0021-9673(85)80005-4
. [all data]
Hanaoka, Nomura, et al., 2006
Hanaoka, S.; Nomura, K.; Wada, T.,
Determination of mustard and lewisite related compounds in abandoned chemical weapons (Yellow shells) from sources in China and Japan,
J. Chromatogr. A, 2006, 1101, 1-2, 268-277, https://doi.org/10.1016/j.chroma.2005.10.028
. [all data]
OPCW, 1997
OPCW,
Conference of the States Parties C-I/DEC.64 (22 May 1997), 1997, retrieved from http://www.opcw.org/html/global/cseries/csp1/CIDEC64.html. [all data]
Waggott and Davies, 1984
Waggott, A.; Davies, I.W.,
Identification of organic pollutants using linear temperature programmed retention indices (LTPRIs) - Part II, 1984, retrieved from http://dwi.defra.gov.uk/research/completed-research/reports/dwi0383.pdf. [all data]